Bicyclo[2.2.1]heptan-2-one, 4,7,7-trimethyl-, (1S)-
- Formula: C10H16O
- Molecular weight: 152.2334
- IUPAC Standard InChIKey: HFQTYOGWDNGZMS-PVSHWOEXSA-N
- CAS Registry Number: 10292-98-5
- Chemical structure:
View 3d structure (requires JavaScript / HTML 5) - Stereoisomers:
- Other names: 3-Bornanone, (1S,4S)-(-)-; β-Camphor; (-)-β-Camphor; (-)-Epi-camphor; Epi-camphor

Normal alkane RI, non-polar column, temperature ramp

Column type | Active phase | I | Reference | Comment |
---|---|---|---|---|
Capillary | SPB-1 | 1145. | Fraternale, Giamperi, et al., 2000 | 30. m/0.2 mm/0.2 μm, He, 80. C @ 3. min, 5. K/min; Tend: 300. C |

References

Fraternale, Giamperi, et al., 2000
Fraternale, D.; Giamperi, L.; Ricci, D.; Manunta, A.,
Composition of the essential oil of Peucedanum verticillare,
Biochem. Syst. Ecol., 2000, 28, 2, 143-147, https://doi.org/10.1016/S0305-1978(99)00049-6
. [all data]