Morpholine, 4-(2-benzothiazolylthio)-
- Formula: C11H12N2OS2
- Molecular weight: 252.356
- IUPAC Standard InChIKey: MHKLKWCYGIBEQF-UHFFFAOYSA-N
- CAS Registry Number: 102-77-2
- Chemical structure:
View 3d structure (requires JavaScript / HTML 5) - Other names: Benzothiazole, 2-(morpholinothio)-; 2-(Morpholinothio)benzothiazole; Amax; Benzothiazole, 2-(4-morpholinylthio)-; Benzothiazolyl-2-sulfenmorpholide; Morpholinylmercaptobenzothiazole; N-(Oxodiethylene)-2-benzothiazolesulfenamide; N-(Oxydiethylene)-2-benzothiazolesulfenamide; N-(Oxydiethylene)benzothiazole-2-sulfenamide; N-(Oxydiethylene)benzothiazylsulfenamide; N,N-(Oxydiethylene)-2-benzothiazolesulfenamide; N,N-(Oxydiethylene)-2-benzothiazylsulfenamide; N,N-(Oxydiethylene)benzothiazole-2-sulfenamide; NOBS Special; Santocure MOR; Sulfenamide M; Sulfenax MOR; Vulcafor BSM; Vulkacit MOZ; 2-(4-Morpholinothio)benzothiazole; 2-(4-Morpholinylmercapto)benzothiazole; 2-Benzothiazolesulfenamide, N-morpholinyl-; 2-Benzothiazolesulfenemorpholide; 2-Benzothiazolyl N-morpholino sulfide; 2-Benzothiazolylsulfenyl morpholine; 4-(2-Benzothiazolylthio)morpholine; USAF CY-7; 2-(4-Morpholinylthio)benzothiazole; N-Oxydiethyl-2-benzthiazolsulfenamid; Sulfenax mob; 2-(Morpholinthio)-benzothiazole; Accelerator NC; Delac MOR; OBTS; MBS; Meramide M; Accel NS; NSC 70078

Phase change data

Data compiled by: Thermodynamics Research Center, NIST Boulder Laboratories, Chris Muzny director
Quantity | Value | Units | Method | Reference | Comment |
---|---|---|---|---|---|
Tfus | 359.45 | K | N/A | Witschonke, 1954 | Uncertainty assigned by TRC = 0.35 K |
Tfus | 360.05 | K | N/A | Witschonke, 1954 | Uncertainty assigned by TRC = 0.2 K |

References

Witschonke, 1954
Witschonke, C.R.,
Freezing point and purity data for some organic compounds,
Anal. Chem., 1954, 26, 562-4. [all data]