Aluminum, tripropyl-
- Formula: C9H21Al
- Molecular weight: 156.2446
- IUPAC Standard InChIKey: CNWZYDSEVLFSMS-UHFFFAOYSA-N
- CAS Registry Number: 102-67-0
- Chemical structure:
View 3d structure (requires JavaScript / HTML 5) - Other names: Tripropylaluminum; UN 2718; tripropylaluminium

Gas phase thermochemistry data

Data compiled by: José A. Martinho Simões
Quantity | Value | Units | Method | Reference | Comment |
---|---|---|---|---|---|
ΔfH°gas | -234. ± 16. | kJ/mol | Review | Martinho Simões | Liquid tripropylaluminum contains a very small molar fraction of monomer at 298 K, ca. 0.5% Smith, 1974, so that the "real" liquid should be described as [Al(Pr)3]2. |
ΔfH°gas | -279.8 ± 1.9 | kJ/mol | Review | Martinho Simões | Liquid tripropylaluminum contains a very small molar fraction of monomer at 298 K, ca. 0.5% Smith, 1974, so that the "real" liquid should be described as [Al(Pr)3]2. |

Condensed phase thermochemistry data

Data compiled as indicated in comments:
MS - José A. Martinho Simões
DH - Eugene S. Domalski and Elizabeth D. Hearing
Quantity | Value | Units | Method | Reference | Comment |
---|---|---|---|---|---|
ΔfH°liquid | -276. ± 16. | kJ/mol | Review | Martinho Simões | Liquid tripropylaluminum contains a very small molar fraction of monomer at 298 K, ca. 0.5% Smith, 1974, so that the "real" liquid should be described as [Al(Pr)3]2.; MS |
ΔfH°liquid | -322.3 ± 1.5 | kJ/mol | Review | Martinho Simões | Liquid tripropylaluminum contains a very small molar fraction of monomer at 298 K, ca. 0.5% Smith, 1974, so that the "real" liquid should be described as [Al(Pr)3]2.; MS |
Quantity | Value | Units | Method | Reference | Comment |
ΔcH°liquid | -7104. ± 16. | kJ/mol | CC-SB | Shmyreva, Sakharovskaya, et al., 1971 | Please also see Pedley and Rylance, 1977.; MS |
ΔcH°liquid | -7058.4 ± 0.4 | kJ/mol | CC-SB | Pawlenko, 1967 | Please also see Pedley and Rylance, 1977 and Cox and Pilcher, 1970.; MS |
Quantity | Value | Units | Method | Reference | Comment |
S°liquid | 370.1 | J/mol*K | N/A | Sheiman, Rabinovich, et al., 1991 | DH |
S°liquid | 370.1 | J/mol*K | N/A | Sheiman, Nistratov, et al., 1984 | DH |
Constant pressure heat capacity of liquid
Cp,liquid (J/mol*K) | Temperature (K) | Reference | Comment |
---|---|---|---|
340.5 | 298.15 | Sheiman, Rabinovich, et al., 1991 | T = 14 to 327 K.; DH |
340.5 | 298.15 | Sheiman, Nistratov, et al., 1984 | T = 5 to 300 K.; DH |

Phase change data

Data compiled by: José A. Martinho Simões
Quantity | Value | Units | Method | Reference | Comment |
---|---|---|---|---|---|
ΔvapH° | 42.5 ± 1.2 | kJ/mol | CC-SB | Shmyreva, Sakharovskaya, et al., 1971 |

Reaction thermochemistry data

Data compiled by: José A. Martinho Simões
Individual Reactions
C18H42Al2 (l) = 2 (l)
By formula: C18H42Al2 (l) = 2C9H21Al (l)
Quantity | Value | Units | Method | Reference | Comment |
---|---|---|---|---|---|
ΔrH° | 64.5 ± 0.8 | kJ/mol | EqS | Smith, 1974 |

References

Martinho Simões
Martinho Simões, J.A.,
Private communication (see http://webbook.nist.gov/chemistry/om/). [all data]
Smith, 1974
Smith, M.B.,
J. Organometal. Chem., 1974, 70, 13. [all data]
Shmyreva, Sakharovskaya, et al., 1971
Shmyreva, G.O.; Sakharovskaya, G.B.; Popov, A.F.; Korneev, N.N.; Smolyaninova, A.A.,
Russ. J. Phys. Chem., 1971, 45, 260. [all data]
Pedley and Rylance, 1977
Pedley, J.B.; Rylance, J.,
Computer Analysed Thermochemical Data: Organic and Organometallic Compounds, University of Sussex, Brigton, 1977. [all data]
Pawlenko, 1967
Pawlenko, S.,
Chem. Ber., 1967, 100, 3591. [all data]
Cox and Pilcher, 1970
Cox, J.D.; Pilcher, G.,
Thermochemistry of Organic and Organometallic Compounds
in Academic Press, New York, 1970. [all data]
Sheiman, Rabinovich, et al., 1991
Sheiman, M.S.; Rabinovich, I.B.; Nistratov, V.P.; Smirnova, N.N.; Kamelova, G.P.; Klimov, K.N.; Zorin, A.D.,
Low temperature heat capacity and thermodynamic functions of tripropylaluminum and diisobutylaluminum,
Zhur. Fiz. Khim., 1991, 65(3), 831-836. [all data]
Sheiman, Nistratov, et al., 1984
Sheiman, M.S.; Nistratov, V.P.; Kamelova, G.P.; Rabinovich, I.B.,
Low-temperature heat capacity of organic compounds of aluminum and zinc, Probl. Kalorim. Khim. Termodin., Dokl. Vses. Konf.,
10th, 1984, 2, 457-459. [all data]