U(BH4)4 radical
- Formula: B4H16U
- Molecular weight: 297.400
- CAS Registry Number: 102630-71-7

Gas phase ion energetics data

Data compiled by: John E. Bartmess
Electron affinity determinations
EA (eV) | Method | Reference | Comment |
---|---|---|---|
<1.13649 | IMRB | Armentrout and Beauchamp, 1979 | No electron transfer from NO2- to neutral. |

Reaction thermochemistry data

Data compiled by: John E. Bartmess

Individual Reactions

Fluorine anion + H16B4U = (Fluorine anion • H16B4U)

By formula: F- + H16B4U = (F- • H16B4U)

Quantity Value Units Method Reference Comment
Δr188. ± 34.kJ/molIMRBBabcock, Herd, et al., 1984gas phase; Obs. F- transfer from SF6-, not from UF5-

Ion clustering data

Data compiled by: John E. Bartmess

Clustering reactions

Fluorine anion + H16B4U = (Fluorine anion • H16B4U)

By formula: F- + H16B4U = (F- • H16B4U)

Quantity Value Units Method Reference Comment
Δr188. ± 34.kJ/molIMRBBabcock, Herd, et al., 1984gas phase; Obs. F- transfer from SF6-, not from UF5-

References

Armentrout and Beauchamp, 1979
Armentrout, P.B.; Beauchamp, J.L.,
Properties and reactions of uranium(IV) tetrahydroborate by ion cyclotron mass spectrometry,
Inorg. Chem., 1979, 18, 1349. [all data]