2-Fluorobenzyl acetate
- Formula: C9H9FO2
- Molecular weight: 168.1650
- IUPAC Standard InChIKey: LVEUCRHYUFCCSC-UHFFFAOYSA-N
- CAS Registry Number: 102606-96-2
- Chemical structure:
View 3d structure (requires JavaScript / HTML 5) - Other names: (2-Fluorophenyl)methyl acetate; Acetic acid, (2-fluorophenyl)methyl ester

Van Den Dool and Kratz RI, non-polar column, temperature ramp

Column type | Active phase | I | Reference | Comment |
---|---|---|---|---|
Capillary | VF-5MS | 1171. | N/A | 30. m/0.25 mm/0.25 μm, He; Tstart: 60. C; Tend: 270. C |
Capillary | 5 % Phenyl methyl siloxane | 1182. | Zaikin, 2010 | 30. m/0.25 mm/0.25 μm, 15. K/min, 270. C @ 15. min; Tstart: 60. C |

References

Zaikin, 2010
Zaikin, V.G.,
Personal communication: Retention indices measured during 2010, 2010. [all data]