Ethyl-3-methoxybenzoate
- Formula: C10H12O3
- Molecular weight: 180.2005
- IUPAC Standard InChIKey: GSQLMBQLTPEPHD-UHFFFAOYSA-N
- CAS Registry Number: 10259-22-0
- Chemical structure:
View 3d structure (requires JavaScript / HTML 5) - Other names: ethyl m-anisate; Benzoic acid, 3-methoxy-, ethyl ester

Phase change data

Data compiled as indicated in comments:
TRC - Thermodynamics Research Center, NIST Boulder Laboratories, Chris Muzny director
BS - Robert L. Brown and Stephen E. Stein
Quantity | Value | Units | Method | Reference | Comment |
---|---|---|---|---|---|
Tboil | 533.65 | K | N/A | Perkin, 1896 | Uncertainty assigned by TRC = 1. K; TRC |
Reduced pressure boiling point
Tboil (K) | Pressure (bar) | Reference | Comment |
---|---|---|---|
383.2 | 0.007 | Weast and Grasselli, 1989 | BS |

Van Den Dool and Kratz RI, non-polar column, temperature ramp

Column type | Active phase | I | Reference | Comment |
---|---|---|---|---|
Capillary | VF-5MS | 1424. | Todua, 2011 | 30. m/0.25 mm/0.25 μm, He; Tstart: 60. C; Tend: 270. C |

References

Perkin, 1896
Perkin, W.H.,
LXIX. On Magnetic Rotatory Power, especially of Aromatic Compounds,
J. Chem. Soc., 1896, 69, 1025-1257. [all data]
Weast and Grasselli, 1989
CRC Handbook of Data on Organic Compounds, 2nd Editon, Weast,R.C and Grasselli, J.G., ed(s)., CRC Press, Inc., Boca Raton, FL, 1989, 1. [all data]
Lang (editor), 1965
Lang (editor), L.,
Absorption Spectra in the Ultraviolet and Visible Region, 1965, 5, 63. [all data]
Todua, 2011
Todua, N.G.,
Retention Data. NIST Mass Spectrometry Data Center., NIST Mass Spectrometry Data Center, 2011. [all data]