Heptachlor epoxide
- Formula: C10H5Cl7O
- Molecular weight: 389.317
- IUPAC Standard InChIKey: ZXFXBSWRVIQKOD-UHFFFAOYSA-N
- CAS Registry Number: 1024-57-3
- Chemical structure:
- Other names: 2,5-Methano-2H-indeno[1,2-b]oxirene, 2,3,4,5,6,7,7-heptachloro-1a,1b,5,5a,6,6a-hexahydro-, (1aα,1bβ,2α,5α,5aβ,6β,6aα)-; 4,7-Methanoindan, 1,4,5,6,7,8,8-heptachloro-2,3-epoxy-3a,4,7,7a-tetrahydro-; Epoxyheptachlor; ENT 25,584; HCE; Velsicol 53-CS-17; 1,4,5,6,7,8,8-heptachloro-2,3-epoxy-3a,4,7,7a-tetrahydro-4,7-methanoindane; 2,5-Methano-2H-indeno[1,2-b]oxirene, 2,3,4,5,6,7,7-heptachloro-1a,1b,5,5a,6,6a-hexahydro-,(1aR,1bS,2R,5S,5aR,6S,6aR)-rel-; Heptachlore epoxide; 1,4,5,6,7,8,8-Heptachloro-2,3-epoxy-3a,4,7,7a-tetrahydro-4,7-endo-methanoindan

Phase change data

Data compiled as indicated in comments:
TRC - Thermodynamics Research Center, NIST Boulder Laboratories, Chris Muzny director
AC - William E. Acree, Jr., James S. Chickos
Quantity | Value | Units | Method | Reference | Comment |
---|---|---|---|---|---|
Tfus | 439. | K | N/A | Plato, 1972 | Crystal phase 1 phase; Uncertainty assigned by TRC = 1. K; TRC |
Tfus | 436.0 | K | N/A | Plato and Glasgow, 1969 | Uncertainty assigned by TRC = 0.2 K; TRC |
Enthalpy of vaporization
ΔvapH (kcal/mol) | Temperature (K) | Method | Reference | Comment |
---|---|---|---|---|
18. | 373. to 423. | GC | Goel, McConnell, et al., 2007 | AC |
Enthalpy of fusion
ΔfusH (kcal/mol) | Temperature (K) | Method | Reference | Comment |
---|---|---|---|---|
0.681 | 434.9 | DSC | Ksia«807»azczak and Nagata, 1995 | AC |

Normal alkane RI, non-polar column, custom temperature program

View large format table.

Column type Active phase I Reference Comment
CapillaryOV-12012.Waggott and Davies, 1984Hydrogen; Column length: 50. m; Column diameter: 0.32 mm; Program: not specified
CapillaryOV-1, SE-30, Methyl silicone, SP-2100, OV-101, DB-1, etc.2012.Waggott and Davies, 1984Hydrogen; Column length: 50. m; Column diameter: 0.32 mm; Program: not specified
CapillaryOV-1, SE-30, Methyl silicone, SP-2100, OV-101, DB-1, etc.2015.Waggott and Davies, 1984Hydrogen; Column length: 50. m; Column diameter: 0.32 mm; Program: not specified

Normal alkane RI, polar column, custom temperature program

View large format table.

Column type Active phase I Reference Comment
CapillarySuperox 0.6; Carbowax 20M2828.Waggott and Davies, 1984Hydrogen; Column length: 50. m; Column diameter: 0.32 mm; Program: not specified
CapillaryCarbowax 400, Carbowax 20M, Carbowax 1540, Carbowax 4000, Superox 06, PEG 20M, etc.2828.Waggott and Davies, 1984Hydrogen; Column length: 50. m; Column diameter: 0.32 mm; Program: not specified

References

Plato, 1972
Plato, C.,
DSC as a general method for determining purity and heat of fusion of high-purity organic chemicals,
Anal. Chem., 1972, 44, 1531. [all data]
Plato and Glasgow, 1969
Plato, C.; Glasgow, A.R., Jr.,
Differential scanning calorimetry as a general method for determining the purity and heat of fusion of high-purity organic chemicals. Application to 95 compounds,
Anal. Chem., 1969, 41, 2, 330, https://doi.org/10.1021/ac60271a041
. [all data]
Goel, McConnell, et al., 2007
Goel, Anubha; McConnell, Laura L.; Torrents, Alba,
Determination of vapor pressure-temperature relationships of current--use pesticides and transformation products,
Journal of Environmental Science and Health, Part B, 2007, 42, 4, 343-349, https://doi.org/10.1080/03601230701309494
. [all data]
Ksia«807»azczak and Nagata, 1995
Ksia«807»azczak, A.; Nagata, I.,
Crystal-plastic and plastic-liquid phase transitions, and purity determination,
Thermochimica Acta, 1995, 254, 31-39, https://doi.org/10.1016/0040-6031(94)02032-J
. [all data]