Benzene, 1,2-dichloro-4-isocyanato-
- Formula: C7H3Cl2NO
- Molecular weight: 188.011
- IUPAC Standard InChIKey: MFUVCHZWGSJKEQ-UHFFFAOYSA-N
- CAS Registry Number: 102-36-3
- Chemical structure:
View 3d structure (requires JavaScript / HTML 5) - Other names: 3,4-Dichlorophenyl isocyanate; Isocyanic acid, 3,4-dichlorophenyl ester; 3,4-Dichlorfenylisokyanat; 3,4-Dichlorphenyl isocyanate

Condensed phase thermochemistry data

Data compiled by: Hussein Y. Afeefy, Joel F. Liebman, and Stephen E. Stein
Quantity | Value | Units | Method | Reference | Comment |
---|---|---|---|---|---|
ΔfH°solid | -119. ± 4.2 | kJ/mol | Ccb | Selivanov and Konstantinov, 1975 | |
Quantity | Value | Units | Method | Reference | Comment |
ΔcH°solid | -3105. ± 4.2 | kJ/mol | Ccb | Selivanov and Konstantinov, 1975 |

Phase change data

Data compiled as indicated in comments:
AC - William E. Acree, Jr., James S. Chickos
Enthalpy of vaporization
ΔvapH (kJ/mol) | Temperature (K) | Method | Reference | Comment |
---|---|---|---|---|
47.4 | 388. | A | Stephenson and Malanowski, 1987 | Based on data from 373. to 473. K.; AC |
Antoine Equation Parameters
log10(P) = A − (B / (T + C))
P = vapor pressure (bar)
T = temperature (K)
View plot Requires a JavaScript / HTML 5 canvas capable browser.
Temperature (K) | A | B | C | Reference | Comment |
---|---|---|---|---|---|
333. to 463. | 4.15096 | 1944.393 | -47.90 | Konstantinov, zhuravlev, et al., 1967 | Coefficents calculated by NIST from author's data. |

Reaction thermochemistry data

Data compiled by: Hussein Y. Afeefy, Joel F. Liebman, and Stephen E. Stein
Individual Reactions
By formula: C9H10Cl2N2O = C7H3Cl2NO + C2H7N
Quantity | Value | Units | Method | Reference | Comment |
---|---|---|---|---|---|
ΔrH° | 118.5 ± 2.3 | kJ/mol | Eqk | Chimishkyan, Svetlova, et al., 1984 | solid phase; Dissociation |
By formula: C13H8Cl4N2O = C7H3Cl2NO + C6H5Cl2N
Quantity | Value | Units | Method | Reference | Comment |
---|---|---|---|---|---|
ΔrH° | 102.1 ± 5.6 | kJ/mol | Eqk | Chimishkyan, Svetlova, et al., 1984 | solid phase; Dissociation |

References

Selivanov and Konstantinov, 1975
Selivanov, V.D.; Konstantinov, I.I.,
Thermochemistry of chloroaryl isocyanates,
Russ. J. Phys. Chem. (Engl. Transl.), 1975, 49, 620-621. [all data]
Stephenson and Malanowski, 1987
Stephenson, Richard M.; Malanowski, Stanislaw,
Handbook of the Thermodynamics of Organic Compounds, 1987, https://doi.org/10.1007/978-94-009-3173-2
. [all data]
Konstantinov, zhuravlev, et al., 1967
Konstantinov, I.I.; zhuravlev, E.Z.; Tenrova, Z.G.,
Some Physico-Chemical Properties of n-Chlorophenyl Isocyanate and 3,4-Dichlorophenylisocyanate,
Zh. Prikl. Khim. (Moscow), 1967, 40, 1084-1087. [all data]
Chimishkyan, Svetlova, et al., 1984
Chimishkyan, A.L.; Svetlova, L.P.; Leonova, T.V.; Gluyaev, N.D.,
Thermal decomposition of substituted ureas,
J. Gen. Chem. USSR, 1984, 54, 1317-1320. [all data]