1-Nitro-2-propanone
- Formula: C3H5NO3
- Molecular weight: 103.0767
- IUPAC Standard InChIKey: QCDJOJKIHZQJGX-UHFFFAOYSA-N
- CAS Registry Number: 10230-68-9
- Chemical structure:
View 3d structure (requires JavaScript / HTML 5) - Other names: 2-Propanone, 1-nitro-; Nitropropanone; Nitroacetone

Condensed phase thermochemistry data

Data compiled by: Hussein Y. Afeefy, Joel F. Liebman, and Stephen E. Stein
Quantity | Value | Units | Method | Reference | Comment |
---|---|---|---|---|---|
ΔfH°solid | -295. ± 0.63 | kJ/mol | Ccb | Lebedeva, Ryadnenko, et al., 1968 | Hf_liquid= -66.55±0.4 kcal/mol, See Lebedeva, Rjadnenko, et al., 1969 |
Quantity | Value | Units | Method | Reference | Comment |
ΔcH°solid | -1600. ± 0.63 | kJ/mol | Ccb | Lebedeva, Ryadnenko, et al., 1968 | Hf_liquid= -66.55±0.4 kcal/mol, See Lebedeva, Rjadnenko, et al., 1969 |

Phase change data

Data compiled by: Robert L. Brown and Stephen E. Stein
Reduced pressure boiling point
Tboil (K) | Pressure (bar) | Reference |
---|---|---|
376.7 | 0.032 | Weast and Grasselli, 1989 |

References

Lebedeva, Ryadnenko, et al., 1968
Lebedeva, N.D.; Ryadnenko, V.L.; Kuznetsova, I.N.,
Heats of combustion and formation of nitroacetone, ethyl nitroacetate, trinitroacetonitrile, trinitroethanol, and trinitroethyl acetate,
Russ. J. Phys. Chem. (Engl. Transl.), 1968, 42, 962-964. [all data]
Lebedeva, Rjadnenko, et al., 1969
Lebedeva, N.D.; Rjadnenko, B.L.; Gutner, N.M.,
Heats of formation of some N-containing organic compounds,
Int. Conf. Calorim. Therm. (Warsaw, Poland), 1969, 1-8. [all data]
Weast and Grasselli, 1989
CRC Handbook of Data on Organic Compounds, 2nd Editon, Weast,R.C and Grasselli, J.G., ed(s)., CRC Press, Inc., Boca Raton, FL, 1989, 1. [all data]