3-Pentyn-1-ol
- Formula: C5H8O
- Molecular weight: 84.1164
- IUPAC Standard InChIKey: IDYNOORNKYEHHO-UHFFFAOYSA-N
- CAS Registry Number: 10229-10-4
- Chemical structure:
View 3d structure (requires JavaScript / HTML 5) - Other names: pent-3-yn-1-ol

Phase change data

Data compiled by: Robert L. Brown and Stephen E. Stein
Quantity | Value | Units | Method | Reference | Comment |
---|---|---|---|---|---|
Tboil | 427. to 430. | K | N/A | Farchan Laboratories, 1990 | |
Tboil | 428.7 | K | N/A | Weast and Grasselli, 1989 |

References

Farchan Laboratories, 1990
Farchan Laboratories,
Research Chemicals Catalog, Farchan Laboratories, Gainesville, FL, 1990, 91. [all data]
Weast and Grasselli, 1989
CRC Handbook of Data on Organic Compounds, 2nd Editon, Weast,R.C and Grasselli, J.G., ed(s)., CRC Press, Inc., Boca Raton, FL, 1989, 1. [all data]