Benzenamine, N-ethyl-3-methyl-
- Formula: C9H13N
- Molecular weight: 135.2062
- IUPAC Standard InChIKey: GUYMMHOQXYZMJQ-UHFFFAOYSA-N
- CAS Registry Number: 102-27-2
- Chemical structure:

Gas phase thermochemistry data

Data compiled by: Hussein Y. Afeefy, Joel F. Liebman, and Stephen E. Stein
Quantity | Value | Units | Method | Reference | Comment |
---|---|---|---|---|---|
ΔfH°gas | 7.29 ± 0.91 | kcal/mol | Ccb | Riberio da Silva, Riberio da Silva, et al., 1996 |

Condensed phase thermochemistry data

Data compiled by: Hussein Y. Afeefy, Joel F. Liebman, and Stephen E. Stein
Quantity | Value | Units | Method | Reference | Comment |
---|---|---|---|---|---|
ΔfH°liquid | -7.05 ± 0.55 | kcal/mol | Ccb | Riberio da Silva, Riberio da Silva, et al., 1996 | |
Quantity | Value | Units | Method | Reference | Comment |
ΔcH°liquid | -1283.5 ± 0.55 | kcal/mol | Ccb | Riberio da Silva, Riberio da Silva, et al., 1996 |

Phase change data

Data compiled as indicated in comments:
BS - Robert L. Brown and Stephen E. Stein
ALS - Hussein Y. Afeefy, Joel F. Liebman, and Stephen E. Stein
DRB - Donald R. Burgess, Jr.
AC - William E. Acree, Jr., James S. Chickos
Quantity | Value | Units | Method | Reference | Comment |
---|---|---|---|---|---|
Tboil | 494.2 | K | N/A | Weast and Grasselli, 1989 | BS |
Quantity | Value | Units | Method | Reference | Comment |
ΔvapH° | 14.3 ± 0.72 | kcal/mol | V | Riberio da Silva, Riberio da Silva, et al., 1996 | ALS |
ΔvapH° | 14.3 | kcal/mol | N/A | Riberio da Silva, Riberio da Silva, et al., 1996 | DRB |
ΔvapH° | 14.3 ± 0.72 | kcal/mol | CGC | Riberio da Silva, Riberio da Silva, et al., 1996 | AC |

Van Den Dool and Kratz RI, non-polar column, temperature ramp

Column type | Active phase | I | Reference | Comment |
---|---|---|---|---|
Capillary | OV-1 | 1200. | Gautzsch and Zinn, 1996 | 8. K/min; Tstart: 35. C; Tend: 300. C |

Normal alkane RI, polar column, custom temperature program

Column type | Active phase | I | Reference | Comment |
---|---|---|---|---|
Capillary | DB-Wax | 1802. | Peng, Yang, et al., 1991 | Program: not specified |

References

Riberio da Silva, Riberio da Silva, et al., 1996
Riberio da Silva, M.A.V.; Riberio da Silva, M.D.M.C.; Monteiro, M.F.B.M.; Gomes, M.L.A.C.N.; Chickos, J.S.; Smith, A.P.; Liebman, J.F.,
Thermochemical studies for determination of the molar enthalpy of formation of aniline derivatives,
Struct. Chem., 1996, 7, 367-373. [all data]
Weast and Grasselli, 1989
CRC Handbook of Data on Organic Compounds, 2nd Editon, Weast,R.C and Grasselli, J.G., ed(s)., CRC Press, Inc., Boca Raton, FL, 1989, 1. [all data]
Gautzsch and Zinn, 1996
Gautzsch, R.; Zinn, P.,
Use of incremental models to estimate the retention indexes of aromatic compounds,
Chromatographia, 1996, 43, 3/4, 163-176, https://doi.org/10.1007/BF02292946
. [all data]
Peng, Yang, et al., 1991
Peng, C.T.; Yang, Z.C.; Ding, S.F.,
Prediction of rentention idexes. II. Structure-retention index relationship on polar columns,
J. Chromatogr., 1991, 586, 1, 85-112, https://doi.org/10.1016/0021-9673(91)80028-F
. [all data]