Methanone, [5-chloro-2-(methylamino)phenyl]phenyl-
- Formula: C14H12ClNO
- Molecular weight: 245.704
- IUPAC Standard InChIKey: WPNMLCMTDCANOZ-UHFFFAOYSA-N
- CAS Registry Number: 1022-13-5
- Chemical structure:
View 3d structure (requires JavaScript / HTML 5) - Other names: Benzophenone, 5-chloro-2-(methylamino)-; [5-Chloro-2-(methylamino)phenyl]phenylmethanone; 5-Chloro-2-(methylamino)benzophenone; 2-Methylamino-5-chlorobenzophenone; Benzophenone, 2-acetamido-5-chloro-; 2-Methylamino-5-chlorbenzophenone; Diazepam, hydrolysis; Diazepam benzophenone; Camazepam M (temazepam), hydrolysis; Tetrazepam M (dihydroxy-)-2H2O, hydrolysis; Ketazolam + M (diazepam), hydrolysis; Diazepam, acid hydrolyzed; Temazepam, hydrolysis

Kovats' RI, non-polar column, isothermal

Column type | Active phase | Temperature (C) | I | Reference | Comment |
---|---|---|---|---|---|
Capillary | BP-1 | 200. | 2088. | Japp, Garthwaite, et al., 1988 | 25. m/0.22 mm/0.25 μm, N2 |
Capillary | HP-1 | 200. | 2076. | Japp, Garthwaite, et al., 1988 | 30. m/0.53 mm/0.88 μm, N2 |
Capillary | SPB-1 | 250. | 2115. | Lora-Tamayo, Rams, et al., 1986 | He; Column length: 25. m; Column diameter: 0.20 mm |
Packed | SE-30 | 220. | 2105. | Schütz, 1982 | N2 |
Packed | SE-30 | 280. | 2104. | Schütz, 1982 | N2 |

Kovats' RI, non-polar column, temperature ramp

Column type | Active phase | I | Reference | Comment |
---|---|---|---|---|
Packed | OV-101 | 2100. | Maurer, 1990 | N2, Chromosorb G HP, 100. C @ 3. min, 30. K/min, 310. C @ 5. min; Column length: 0.6 m |
Capillary | Cross-Linked Methylsilicone | 2100. | Maurer and Pfleger, 1987 | 12. m/0.2 mm/0.33 μm, He, 100. C @ 3. min, 30. K/min, 310. C @ 5. min |
Capillary | Cross-Linked Methylsilicone | 2100. | Maurer and Pfleger, 1987 | 12. m/0.2 mm/0.33 μm, He, 100. C @ 3. min, 30. K/min, 310. C @ 5. min |
Capillary | Cross-Linked Methylsilicone | 2100. | Maurer and Pfleger, 1987 | 12. m/0.2 mm/0.33 μm, He, 100. C @ 3. min, 30. K/min, 310. C @ 5. min |
Capillary | Cross-Linked Methylsilicone | 2100. | Maurer and Pfleger, 1987 | 12. m/0.2 mm/0.33 μm, He, 100. C @ 3. min, 30. K/min, 310. C @ 5. min |
Capillary | Cross-Linked Methylsilicone | 2100. | Maurer and Pfleger, 1987 | 12. m/0.2 mm/0.33 μm, He, 100. C @ 3. min, 30. K/min, 310. C @ 5. min |

Normal alkane RI, non-polar column, custom temperature program

Column type | Active phase | I | Reference | Comment |
---|---|---|---|---|
Capillary | HP-5MS | 2100. | Augsburger, Rivier, et al., 1998 | 30. m/0.25 mm/0.25 μm; Program: not specified |

References

Japp, Garthwaite, et al., 1988
Japp, M.; Garthwaite, K.; Geeson, A.V.; Osselton, M.D.,
Collection of Analytical Data for Benzodiazepines and Benzophenones,
J. Chromatogr., 1988, 439, 2, 317-339, https://doi.org/10.1016/S0021-9673(01)83844-9
. [all data]
Lora-Tamayo, Rams, et al., 1986
Lora-Tamayo, C.; Rams, M.A.; Chacon, J.M.R.,
Gas Chromatographic Data for 187 Nitrogen- or Phosphorus-Containing Drugs and Metabolites of Toxicological Interest Analysed on Methyl Silicone Capillary Columns,
J. Chromatogr., 1986, 374, 73-85, https://doi.org/10.1016/S0378-4347(00)83254-5
. [all data]
Schütz, 1982
Schütz, H.,
Benzodiazepines, Springer-Verlag, New York, 1982, 438. [all data]
Maurer, 1990
Maurer, H.H.,
Detection of anticonvulsants and their metabolites in urine within a general unknown analysis procedure using computerized gas chromatography-mass spectrometry,
Arch. Toxicol., 1990, 64, 7, 554-561, https://doi.org/10.1007/BF01971834
. [all data]
Maurer and Pfleger, 1987
Maurer, H.; Pfleger, K.,
Identification and differentiation of benzodiazepines and their metabolites in urine by computerized gas chromatography-mass spectrometry,
J. Chromatogr., 1987, 422, 85-101, https://doi.org/10.1016/0378-4347(87)80442-5
. [all data]
Augsburger, Rivier, et al., 1998
Augsburger, M.; Rivier, L.; Mangin, P.,
Comparison of different immunoassays and GC-MS screening of benzodiazepines in urine,
J. Pharm. Biomed. Anal., 1998, 18, 4-5, 681-687, https://doi.org/10.1016/S0731-7085(98)00266-0
. [all data]