Naphthalene, 1,2,3,5,6,7,8,8a-octahydro-1,8a-dimethyl-7-(1-methylethenyl)-, [1S-(1α,7α,8aα)]-
- Formula: C15H24
- Molecular weight: 204.3511
- IUPAC Standard InChIKey: QEBNYNLSCGVZOH-GZBFAFLISA-N
- CAS Registry Number: 10219-75-7
- Chemical structure:
View 3d structure (requires JavaScript / HTML 5) - Stereoisomers:
- Other names: Eremophila-1(10),11-diene; Eremophilene; Naphthalene, 1,2,3,5,6,7,8,8a-octahydro-1,8a-dimethyl-7-(1-methylethenyl)-, (1S,7R,8aR)-

Van Den Dool and Kratz RI, non-polar column, temperature ramp

Column type | Active phase | I | Reference | Comment |
---|---|---|---|---|
Capillary | HP-5MS | 1486. | Pino, Mesa, et al., 2005 | 30. m/0.25 mm/0.25 μm, He, 60. C @ 2. min, 4. K/min, 250. C @ 20. min |
Capillary | DB-5 | 1498. | Jantan, Ling, et al., 2003 | 30. m/0.25 mm/0.25 μm, He, 75. C @ 10. min, 3. K/min, 230. C @ 20. min |
Capillary | HP-5 | 1503. | Skaltsa, Demetzos, et al., 2003 | 30. m/0.25 mm/0.25 μm, He, 60. C @ 5. min, 4. K/min; Tend: 280. C |
Capillary | CP Sil 5 CB | 1486. | Pino, Marbot, et al., 2001 | 50. m/0.32 mm/0.4 μm, He, 60. C @ 10. min, 3. K/min, 280. C @ 60. min |
Capillary | HP-5MS | 1502. | Skaltsa, Mavrommati, et al., 2001 | 30. m/0.25 mm/0.25 μm, He, 60. C @ 5. min, 4. K/min; Tend: 280. C |
Capillary | DB-5 | 1489. | Nogueira, Marsaioli, et al., 1998 | 30. m/0.25 mm/0.25 μm, H2, 3. K/min; Tstart: 60. C; Tend: 240. C |
Capillary | HP-5 | 1504. | Oprean, Tamas, et al., 1998 | He, 3. K/min; Column diameter: 0.26 mm; Phase thickness: 0.25 μm; Tstart: 60. C; Tend: 240. C |

Van Den Dool and Kratz RI, non-polar column, custom temperature program

Column type | Active phase | I | Reference | Comment |
---|---|---|---|---|
Capillary | BPX-5 | 1514. | Dharmawan, Kasapis, et al., 2007 | 30. m/0.25 mm/0.25 μm, He; Program: 35C => 4C/min => 200C => 30C/min => 300C (3min) |

Van Den Dool and Kratz RI, polar column, temperature ramp

Column type | Active phase | I | Reference | Comment |
---|---|---|---|---|
Capillary | AT-Wax | 1697. | Pino, Marbot, et al., 2001 | 60. m/0.32 mm/0.25 μm, He, 65. C @ 10. min, 2. K/min, 250. C @ 60. min |

Normal alkane RI, non-polar column, temperature ramp

Column type | Active phase | I | Reference | Comment |
---|---|---|---|---|
Capillary | HP-5 MS | 1500. | Zouari, Ayadi, et al., 2012 | 30. m/0.25 mm/0.25 μm, Helium, 50. C @ 1. min, 7. K/min, 250. C @ 5. min |
Capillary | SE-30 | 1486. | Loizzo, Tundis, et al., 2007 | 30. m/0.25 mm/0.25 μm, He, 40. C @ 5. min, 5. K/min, 250. C @ 10. min |
Capillary | HP-5 | 1489. | Loizzo, Tundis, et al., 2007 | 30. m/0.25 mm/0.25 μm, He, 40. C @ 5. min, 5. K/min, 250. C @ 10. min |
Capillary | DB-5 | 1488. | Chagonda and Chalchat, 2005 | 25. m/0.25 mm/0.15 μm, 40. C @ 5. min, 3. K/min; Tend: 220. C |
Capillary | ZB-5 | 1504. | Jürgens and Dötterl, 2004 | 60. m/0.25 mm/0.25 μm, He, 40. C @ 4.6 min, 6. K/min, 260. C @ 1. min |

Normal alkane RI, non-polar column, custom temperature program

Column type | Active phase | I | Reference | Comment |
---|---|---|---|---|
Capillary | DB-5 | 1482. | Barros-Filho, Nunes, et al., 2004 | 30. m/0.25 mm/0.1 μm, He; Program: 35C => 4C/min => 180C => 20C/min => 280C |

Normal alkane RI, polar column, temperature ramp

Column type | Active phase | I | Reference | Comment |
---|---|---|---|---|
Capillary | DB-Wax | 1732. | Guo, Wu, et al., 2008 | 30. m/0.25 mm/0.25 μm, Helium, 60. C @ 2. min, 10. K/min, 250. C @ 10. min |
Capillary | TC-Wax | 1710. | Miyazawa, Teranishi, et al., 2003 | He, 3. K/min; Column length: 60. m; Column diameter: 0.25 mm; Tstart: 80. C; Tend: 240. C |
Capillary | HP-Innowax | 1744. | Kaya, Baser, et al., 1999 | 60. m/0.25 mm/0.25 μm, He, 60. C @ 10. min; Tend: 220. C |

Normal alkane RI, polar column, custom temperature program

Column type | Active phase | I | Reference | Comment |
---|---|---|---|---|
Capillary | Innowax FSC | 1743. | Baser K.H.C., Ozek G., et al., 2006 | 60. m/0.25 mm/0.25 μm, He; Program: 60C(10min) => 4C/min => 220C (10min) => 1C/min => 240C |
Capillary | HP-Innowax FSC | 1743. | Tabanca, Demirci, et al., 2006 | 60. m/0.25 mm/0.25 μm; Program: 60C(10min) => 4C/min => 220C (10min) => 1C/min => 240C |
Capillary | HP-Innowax FSC | 1743. | Demirci, Baser, et al., 2003 | 60. m/0.25 mm/0.25 μm, He; Program: 60C (10min) => 4C/min => 220C (10min) => 1C/min => 240C |
Capillary | HP-Innowax FSC | 1744. | Bagci, Baser, et al., 1999 | 60. m/0.25 mm/0.25 μm, He; Program: 60C(10min) => 4C/min => 220C(10min) => 1C/min => 240C |

References

Pino, Mesa, et al., 2005
Pino, J.A.; Mesa, J.; Muñoz, Y.; Martí, M.P.; Marbot, R.,
Volatile components from mango (Mangifera indica L.) cultivars,
J. Agric. Food Chem., 2005, 53, 6, 2213-2223, https://doi.org/10.1021/jf0402633
. [all data]
Jantan, Ling, et al., 2003
Jantan, I.; Ling, Y.E.; Romli, S.; Ayop, N.; Ahmad, A.S.,
A comparative study of the constituents of the essential oils of three Cinnamomum species from Malaysia,
J. Essent. Oil Res., 2003, 15, 6, 387-391, https://doi.org/10.1080/10412905.2003.9698618
. [all data]
Skaltsa, Demetzos, et al., 2003
Skaltsa, H.D.; Demetzos, C.; Lazari, D.; Sokovic, M.,
Essential oil analysis and antimicrobial activity of eight Stachys species from Greece,
Phytochemistry, 2003, 64, 3, 743-752, https://doi.org/10.1016/S0031-9422(03)00386-8
. [all data]
Pino, Marbot, et al., 2001
Pino, J.A.; Marbot, R.; Vázquez, C.,
Characterization of volatiles in strawberry guava (Psidium cattleianum Sabine) fruit,
J. Agric. Food Chem., 2001, 49, 12, 5883-5887, https://doi.org/10.1021/jf010414r
. [all data]
Skaltsa, Mavrommati, et al., 2001
Skaltsa, H.D.; Mavrommati, A.; Constantinidis, T.,
A chemotaxonomic investigation of volatile constituents in Stachys subsect. Swainsonianeae (Labiatae),
Phytochemistry, 2001, 57, 2, 235-244, https://doi.org/10.1016/S0031-9422(01)00003-6
. [all data]
Nogueira, Marsaioli, et al., 1998
Nogueira, P.C.L.; Marsaioli, A.J.; Amaral, M.C.E.; Bittrich, V.,
The fragrant floral oils of Tovomita species,
Phytochemistry, 1998, 49, 4, 1009-1012, https://doi.org/10.1016/S0031-9422(97)01046-7
. [all data]
Oprean, Tamas, et al., 1998
Oprean, R.; Tamas, M.; Sandulescu, R.; Roman, L.,
Essential oils analysis. I. Evaluation of essential oils composition using both GC and MS fingerprints,
J. Pharm. Biomed. Anal., 1998, 18, 4-5, 651-657, https://doi.org/10.1016/S0731-7085(98)00283-0
. [all data]
Dharmawan, Kasapis, et al., 2007
Dharmawan, J.; Kasapis, S.; Curran, P.; Johnson, J.R.,
Characterization of volatile compounds in selected citrus fruits from Asia. Part I: freshly-squeezed juice,
Flavour Fragr. J., 2007, 22, 3, 228-232, https://doi.org/10.1002/ffj.1790
. [all data]
Zouari, Ayadi, et al., 2012
Zouari, N.; Ayadi, I.; Fakhfakh, N.; Rebai, A.; Zouari, S.,
Variations of chemical composition of essential oils in wild-populations of Thymus algeriensis Boiss et Reut., a North African endemic species,
Lipids in Health and Desease, 2012, 11, 1, 28-39, https://doi.org/10.1186/1476-511X-11-28
. [all data]
Loizzo, Tundis, et al., 2007
Loizzo, M.R.; Tundis, R.; Conforti, F.; Saab, A.M.; Statti, G.A.; Menichini, F.,
Comparative chemical composition, antioxidant and hypoglycaemic activities of Juniperus oxycedrus ssp. oxycedrus L. berry and wood oils from Lebanon,
Food Chem., 2007, 105, 2, 572-578, https://doi.org/10.1016/j.foodchem.2007.04.015
. [all data]
Chagonda and Chalchat, 2005
Chagonda, L.S.; Chalchat, J.-C.,
The essential oil of the fruit of Garcinia huillensis Welw. ex. Oliv. from Zimbabwe,
Flavour Fragr. J., 2005, 20, 3, 313-315, https://doi.org/10.1002/ffj.1420
. [all data]
Jürgens and Dötterl, 2004
Jürgens, A.; Dötterl, S.,
Chemical composition of anther volatiles in Ranunculaceae: genera-specific profiles in Aemone, Aquilegia, Caltha, Pulsatilla, Ranunculus, and Trollius species,
American Journal of Botany, 2004, 91, 12, 1969-1980, https://doi.org/10.3732/ajb.91.12.1969
. [all data]
Barros-Filho, Nunes, et al., 2004
Barros-Filho, B.A.; Nunes, F.M.; de Oliveira, M.C.F.; Mafezoli, J.; Andrade-Neto, M.; Silveira, E.R.; Pirani, J.R.,
Volatile constituents from Esenbeckia almawillia (Rutaceae),
Biochem. Syst. Ecol., 2004, 32, 9, 817-821, https://doi.org/10.1016/j.bse.2004.02.003
. [all data]
Guo, Wu, et al., 2008
Guo, L.; Wu, J.-Z.; Han, T.; Cao, T.; Rahman, K.; Qin, L.-P.,
Chemical composition, antifungal and antitumor properties of ether extracts of Scapania verrucosa Heeg. and its endophytic fungus Chaetomium fusiforme,
Molecules, 2008, 13, 9, 2114-2125, https://doi.org/10.3390/molecules13092114
. [all data]
Miyazawa, Teranishi, et al., 2003
Miyazawa, M.; Teranishi, A.; Ishikawa, Y.,
Components of the essential oil from Petasites japonicus,
Flavour Fragr. J., 2003, 18, 3, 231-233, https://doi.org/10.1002/ffj.1203
. [all data]
Kaya, Baser, et al., 1999
Kaya, A.; Baser, K.H.C.; Tümen, G.; Koca, F.,
The essential oil of Acinos suaveolens (Sm.) G. Don fil. Acinos arvensis (Lam.) Dandy and Acinos rotundifolius Pers. growing wild in Turkey,
Flavour Fragr. J., 1999, 14, 1, 60-64, https://doi.org/10.1002/(SICI)1099-1026(199901/02)14:1<60::AID-FFJ785>3.0.CO;2-0
. [all data]
Baser K.H.C., Ozek G., et al., 2006
Baser K.H.C.; Ozek G.; Ozek T.; Duran A.,
Composition of the essential oil of Centaurea huber-morathii Wagenitz isolated from seeds by microdistillation,
Flavour Fragr. J., 2006, 21, 3, 568-570, https://doi.org/10.1002/ffj.1620
. [all data]
Tabanca, Demirci, et al., 2006
Tabanca, N.; Demirci, B.; Ozek, T.; Kirimer, N.; Can Baser, K.H.; Bedir, E.; Khan, I.A.; Wedge, D.E.,
Gas chromatographic-mass spectrometric analysis of essential oils from Pimpinella species gathered from Central and Northern Turkey,
J. Chromatogr. A, 2006, 1117, 2, 194-205, https://doi.org/10.1016/j.chroma.2006.03.075
. [all data]
Demirci, Baser, et al., 2003
Demirci, B.; Baser, K.H.C.; Yildiz, B.; Bahcecioglu, Z.,
Composition of the essential oils of six endemic Salvia spp. from Turkey,
Flavour Fragr. J., 2003, 18, 2, 116-121, https://doi.org/10.1002/ffj.1173
. [all data]
Bagci, Baser, et al., 1999
Bagci, E.; Baser, K.H.C.; Kürkcüoglu, M.; Babac, T.; Celik, S.,
Study of the essential oil composition of two subspecies of Abies cilicica (Ant. et Kotschy) Carr. from Turkey,
Flavour Fragr. J., 1999, 14, 1, 47-49, https://doi.org/10.1002/(SICI)1099-1026(199901/02)14:1<47::AID-FFJ782>3.0.CO;2-R
. [all data]