Ethyl tert-butyl disulphide
- Formula: C6H14S2
- Molecular weight: 150.305
- IUPAC Standard InChIKey: CLMXSBZIYJITQU-UHFFFAOYSA-N
- CAS Registry Number: 102107-90-4
- Chemical structure:
View 3d structure (requires JavaScript / HTML 5) - Species with the same structure:

Gas phase thermochemistry data

Data compiled by: Hussein Y. Afeefy, Joel F. Liebman, and Stephen E. Stein
Quantity | Value | Units | Method | Reference | Comment |
---|---|---|---|---|---|
ΔfH°gas | -137. | kJ/mol | Ion | Hawari, Griller, et al., 1986 |

References

Hawari, Griller, et al., 1986
Hawari, J.A.; Griller, D.; Lossing, F.P.,
Thermochemistry of perthiyl radicals,
J. Am. Chem. Soc., 1986, 108, 3273-3275. [all data]