5-Dodecanol
- Formula: C12H26O
- Molecular weight: 186.3342
- IUPAC Standard InChIKey: AVERNHDYEFYHIV-UHFFFAOYSA-N
- CAS Registry Number: 10203-33-5
- Chemical structure:
View 3d structure (requires JavaScript / HTML 5) - Other names: dodecan-5-ol

Phase change data

Data compiled by: William E. Acree, Jr., James S. Chickos
Enthalpy of vaporization
ΔvapH (kJ/mol) | Temperature (K) | Method | Reference | Comment |
---|---|---|---|---|
79.4 | 318. | A,ME | Stephenson and Malanowski, 1987 | Based on data from 293. to 343. K. See also Geiseler, Quitzsch, et al., 1962. |

Normal alkane RI, non-polar column, custom temperature program

Column type | Active phase | I | Reference | Comment |
---|---|---|---|---|
Capillary | OV-101 | 1474. | Qin, 2009 | Program: not specified |

Normal alkane RI, polar column, custom temperature program

Column type | Active phase | I | Reference | Comment |
---|---|---|---|---|
Capillary | PEG-20M | 1772. | Qin, 2009 | Program: not specified |

References

Stephenson and Malanowski, 1987
Stephenson, Richard M.; Malanowski, Stanislaw,
Handbook of the Thermodynamics of Organic Compounds, 1987, https://doi.org/10.1007/978-94-009-3173-2
. [all data]
Geiseler, Quitzsch, et al., 1962
Geiseler, G.; Quitzsch, K.; Hesselbach, J.; Huettig, R.,
Z. Phys. Chem. (Leipzig), 1962, 200, 79. [all data]
Qin, 2009
Qin, Z.,
Relationship between the molecular structure and gas chromatographic retention index of alcohol isomer,
J. Xuzhou Norm. Univ. (Nat. Sci. Edn.), 2009, 27, 2, 88-90. [all data]