4-Dodecanol
- Formula: C12H26O
- Molecular weight: 186.3342
- IUPAC Standard InChIKey: ZGSIAHIBHSEKPB-UHFFFAOYSA-N
- CAS Registry Number: 10203-32-4
- Chemical structure:
View 3d structure (requires JavaScript / HTML 5) - Other names: 4-Hydroxydodecane; dodecan-4-ol

Phase change data

Data compiled by: William E. Acree, Jr., James S. Chickos
Enthalpy of vaporization
ΔvapH (kJ/mol) | Temperature (K) | Method | Reference | Comment |
---|---|---|---|---|
80.6 | 318. | A,ME | Stephenson and Malanowski, 1987 | Based on data from 293. to 343. K. See also Geiseler, Quitzsch, et al., 1962. |

Kovats' RI, polar column, isothermal

Column type | Active phase | Temperature (C) | I | Reference | Comment |
---|---|---|---|---|---|
Packed | Carbowax 20M | 130. | 1752. | Singliar, 1972 | Column length: 2.55 m |
Packed | Carbowax 20M | 165. | 1763. | Singliar, 1972 | Column length: 2.55 m |

Normal alkane RI, non-polar column, custom temperature program

Column type | Active phase | I | Reference | Comment |
---|---|---|---|---|
Capillary | OV-101 | 1482. | Qin, 2009 | Program: not specified |

Normal alkane RI, polar column, custom temperature program

Column type | Active phase | I | Reference | Comment |
---|---|---|---|---|
Capillary | PEG-20M | 1784. | Qin, 2009 | Program: not specified |

References

Stephenson and Malanowski, 1987
Stephenson, Richard M.; Malanowski, Stanislaw,
Handbook of the Thermodynamics of Organic Compounds, 1987, https://doi.org/10.1007/978-94-009-3173-2
. [all data]
Geiseler, Quitzsch, et al., 1962
Geiseler, G.; Quitzsch, K.; Hesselbach, J.; Huettig, R.,
Z. Phys. Chem. (Leipzig), 1962, 200, 79. [all data]
Singliar, 1972
Singliar, M.,
Chromatographic Behaviour and the Structure of Secondary Aliphatic Alcohols,
J. Chromatogr., 1972, 65, 1, 311-321, https://doi.org/10.1016/S0021-9673(00)86946-0
. [all data]
Qin, 2009
Qin, Z.,
Relationship between the molecular structure and gas chromatographic retention index of alcohol isomer,
J. Xuzhou Norm. Univ. (Nat. Sci. Edn.), 2009, 27, 2, 88-90. [all data]