3-Dodecanol
- Formula: C12H26O
- Molecular weight: 186.3342
- IUPAC Standard InChIKey: OKDGZLITBCRLLJ-UHFFFAOYSA-N
- CAS Registry Number: 10203-30-2
- Chemical structure:
View 3d structure (requires JavaScript / HTML 5) - Other names: (dl) 3-dodecanol

Phase change data

Data compiled by: William E. Acree, Jr., James S. Chickos
Enthalpy of vaporization
ΔvapH (kJ/mol) | Temperature (K) | Method | Reference | Comment |
---|---|---|---|---|
78.3 | 318. | A,ME | Stephenson and Malanowski, 1987 | Based on data from 293. to 343. K. See also Geiseler, Quitzsch, et al., 1962. |

Kovats' RI, polar column, isothermal

Column type | Active phase | Temperature (C) | I | Reference | Comment |
---|---|---|---|---|---|
Packed | Carbowax 20M | 130. | 1769. | Singliar, 1972 | Column length: 2.55 m |
Packed | Carbowax 20M | 165. | 1779. | Singliar, 1972 | Column length: 2.55 m |

Normal alkane RI, non-polar column, temperature ramp

Column type | Active phase | I | Reference | Comment |
---|---|---|---|---|
Capillary | BPX5 | 1407. | Dickschat, Bode, et al., 2005 | 25. m/0.22 mm/0.25 μm, Helium, 50. C @ 5. min, 5. K/min; Tend: 320. C |

Normal alkane RI, polar column, custom temperature program

Column type | Active phase | I | Reference | Comment |
---|---|---|---|---|
Capillary | PEG-20M | 1792. | Qin, 2009 | Program: not specified |

References

Stephenson and Malanowski, 1987
Stephenson, Richard M.; Malanowski, Stanislaw,
Handbook of the Thermodynamics of Organic Compounds, 1987, https://doi.org/10.1007/978-94-009-3173-2
. [all data]
Geiseler, Quitzsch, et al., 1962
Geiseler, G.; Quitzsch, K.; Hesselbach, J.; Huettig, R.,
Z. Phys. Chem. (Leipzig), 1962, 200, 79. [all data]
Singliar, 1972
Singliar, M.,
Chromatographic Behaviour and the Structure of Secondary Aliphatic Alcohols,
J. Chromatogr., 1972, 65, 1, 311-321, https://doi.org/10.1016/S0021-9673(00)86946-0
. [all data]
Dickschat, Bode, et al., 2005
Dickschat, J.S.; Bode, H.B.; Wenzel, S.C.; Muller, R.; Schulz, S.,
Biosinthesis and Identification of Volatiles Released by the Myxobacterium Stigmatella aurantiaca,
ChemBioChem, 2005, 6, 11, 2023-2033, https://doi.org/10.1002/cbic.200500174
. [all data]
Qin, 2009
Qin, Z.,
Relationship between the molecular structure and gas chromatographic retention index of alcohol isomer,
J. Xuzhou Norm. Univ. (Nat. Sci. Edn.), 2009, 27, 2, 88-90. [all data]