1,2-Benzenediol, 3,5-bis(1,1-dimethylethyl)-
- Formula: C14H22O2
- Molecular weight: 222.3233
- IUPAC Standard InChIKey: PJZLSMMERMMQBJ-UHFFFAOYSA-N
- CAS Registry Number: 1020-31-1
- Chemical structure:
View 3d structure (requires JavaScript / HTML 5) - Other names: 1,2-Benzenediol, 3,5-di(1,1-dimethylethyl)-; 3,5-di-tert-Butylcatechol; 3,5-di-t-Butylcatechol; Pyrocatechol, 3,5-di-tert-butyl-; 3,5-Di-tert-butylpyrocatechol; 4,6-Di-tert-butylpyrocatechol; 3,5-Di-tert-butyl-1,2-benzenediol; 3,5-Bis(1,1-dimethylethyl)catechol; NSC 59767

Gas phase thermochemistry data

Data compiled by: Hussein Y. Afeefy, Joel F. Liebman, and Stephen E. Stein
Quantity | Value | Units | Method | Reference | Comment |
---|---|---|---|---|---|
ΔfH°gas | -470.5 ± 2.7 | kJ/mol | Ccb | Ribeiro Da Silva and Ribeiro Da Silva, 1984 |

Condensed phase thermochemistry data

Data compiled by: Hussein Y. Afeefy, Joel F. Liebman, and Stephen E. Stein
Quantity | Value | Units | Method | Reference | Comment |
---|---|---|---|---|---|
ΔfH°solid | -570.6 ± 2.6 | kJ/mol | Ccb | Ribeiro Da Silva and Ribeiro Da Silva, 1984 | |
Quantity | Value | Units | Method | Reference | Comment |
ΔcH°solid | -8082.7 ± 1.8 | kJ/mol | Ccb | Ribeiro Da Silva and Ribeiro Da Silva, 1984 | Corresponding ΔfHºsolid = -570.6 kJ/mol (simple calculation by NIST; no Washburn corrections) |

Phase change data

Data compiled as indicated in comments:
AC - William E. Acree, Jr., James S. Chickos
ALS - Hussein Y. Afeefy, Joel F. Liebman, and Stephen E. Stein
DRB - Donald R. Burgess, Jr.
Quantity | Value | Units | Method | Reference | Comment |
---|---|---|---|---|---|
ΔsubH° | 104.7 ± 0.5 | kJ/mol | GS | Verevkin and Schick, 2000 | AC |
ΔsubH° | 100.1 ± 0.6 | kJ/mol | C | Carson, 1984 | AC |
ΔsubH° | 100.1 ± 0.6 | kJ/mol | C | Ribeiro Da Silva and Ribeiro Da Silva, 1984 | ALS |
ΔsubH° | 100.1 | kJ/mol | N/A | Ribeiro Da Silva and Ribeiro Da Silva, 1984 | DRB |
Enthalpy of sublimation
ΔsubH (kJ/mol) | Temperature (K) | Method | Reference | Comment |
---|---|---|---|---|
103.7 ± 0.5 | 330. | GS | Verevkin and Schick, 2000 | AC |
Enthalpy of fusion
ΔfusH (kJ/mol) | Temperature (K) | Reference | Comment |
---|---|---|---|
24.1 | 372.8 | Verevkin and Schick, 2000 | AC |

Normal alkane RI, non-polar column, custom temperature program

View large format table.

Column type Active phase I Reference Comment
CapillaryVF-5MS1683.Xie, Sun, et al., 200630. m/0.25 mm/0.25 μm, He; Program: 40C(1min) => 15C/min => 100C => 4C/min => 250C (1min)

References

Ribeiro Da Silva and Ribeiro Da Silva, 1984
Ribeiro Da Silva, M.D.M.C.; Ribeiro Da Silva, M.A.V.,
Enthalpies of combustion of 1,2-dihydroxybenzene and of six alkylsubstituted 1,2-dihydroxybenzenes,
J. Chem. Thermodyn., 1984, 16, 1149-1155. [all data]
Verevkin and Schick, 2000
Verevkin, Sergey P.; Schick, Christoph,
Substituent Effects on the Benzene Ring. Determination of the Intramolecular Interactions of Substituents in tert -Alkyl-Substituted Catechols from Thermochemical Measurements,
J. Chem. Eng. Data, 2000, 45, 5, 946-952, https://doi.org/10.1021/je0001126
. [all data]
Carson, 1984
Carson, A.S.,
The molar enthalpy of dehydration of Cr2(O2CCH3)4·2H2O(cr) and the molar enthalpies of sublimation of Cr2(O2CCH3)4(cr), Mo2(O2CCH3)4(cr), and Mo2(O2CCF3)4(cr),
The Journal of Chemical Thermodynamics, 1984, 16, 5, 427-429, https://doi.org/10.1016/0021-9614(84)90198-8
. [all data]
Stallings, et al., 1981
Stallings, M.D., et al.,
Inorg. Chem., 1981, 20, 2655. [all data]