Carbamic acid, phenyl-, ethyl ester

Phase change data

Data compiled as indicated in comments:
TRC - Thermodynamics Research Center, NIST Boulder Laboratories, Chris Muzny director
AC - William E. Acree, Jr., James S. Chickos
DH - Eugene S. Domalski and Elizabeth D. Hearing

Quantity Value Units Method Reference Comment
Tfus326.KN/APrivalko, 1971Uncertainty assigned by TRC = 1. K; TRC

Enthalpy of vaporization

ΔvapH (kJ/mol) Temperature (K) Method Reference Comment
84.2395.AStephenson and Malanowski, 1987Based on data from 380. - 510. K. See also Stull, 1947.; AC

Antoine Equation Parameters

log10(P) = A − (B / (T + C))
    P = vapor pressure (bar)
    T = temperature (K)

View plot Requires a JavaScript / HTML 5 canvas capable browser.

Temperature (K) A B C Reference Comment
381.0 - 510.7.322683348.474-52.56Stull, 1947Coefficents calculated by NIST from author's data.

Enthalpy of fusion

ΔfusH (kJ/mol) Temperature (K) Reference Comment
16.272326.Privalko, 1971DH
16.27326.Privalko, 1971, 2AC

Entropy of fusion

ΔfusS (J/mol*K) Temperature (K) Reference Comment
49.9326.Privalko, 1971DH

In addition to the Thermodynamics Research Center (TRC) data available from this site, much more physical and chemical property data is available from the following TRC products:

References

Privalko, 1971
Privalko, V.P., Heat capacities of certain alkyl phenylcarbamates, Zhur. Fiz. Khim., 1971, 45, 1585. [all data]

Stephenson and Malanowski, 1987
Stephenson, Richard M.; Malanowski, Stanislaw, Handbook of the Thermodynamics of Organic Compounds, 1987, https://doi.org/10.1007/978-94-009-3173-2 . [all data]

Stull, 1947
Stull, Daniel R., Vapor Pressure of Pure Substances. Organic and Inorganic Compounds, Ind. Eng. Chem., 1947, 39, 4, 517-540, https://doi.org/10.1021/ie50448a022 . [all data]

Privalko, 1971, 2
Privalko, V.P., Russ. J. Phys. Chem., 1971, 45, 6, 900. [all data]