Cyclohexanol, 1-methyl-4-(1-methylethenyl)-, acetate
- Formula: C12H20O2
- Molecular weight: 196.2860
- IUPAC Standard InChIKey: URVNHQCLMBMWIW-UHFFFAOYSA-N
- CAS Registry Number: 10198-23-9
- Chemical structure:
View 3d structure (requires JavaScript / HTML 5) - Stereoisomers:
- Other names: p-Menth-8-en-1-ol, acetate; β-Terpinyl acetate; 4-Isopropenyl-1-methylcyclohexyl acetate; β-Terpineol, acetate; 1-Methyl-4-(1-methylvinyl)cyclohexyl acetate; β-Terpenyl acetate

Kovats' RI, non-polar column, isothermal

Column type | Active phase | Temperature (C) | I | Reference | Comment |
---|---|---|---|---|---|
Capillary | SE-30 | 100. | 1267.2 | Tudor, 1997 | 40. m/0.35 mm/0.35 μm |

Normal alkane RI, non-polar column, custom temperature program

Column type | Active phase | I | Reference | Comment |
---|---|---|---|---|
Capillary | SE-30 | 1272. | Vinogradov, 2004 | Program: not specified |
Capillary | Methyl Silicone | 1272. | Zenkevich, 1999 | Program: not specified |

Normal alkane RI, polar column, custom temperature program

Column type | Active phase | I | Reference | Comment |
---|---|---|---|---|
Capillary | Carbowax 20M | 1622. | Vinogradov, 2004 | Program: not specified |

References

Tudor, 1997
Tudor, E.,
Temperature dependence of the retention index for perfumery compounds on a SE-30 glass capillary column. I. Linear equations,
J. Chromatogr. A, 1997, 779, 1-2, 287-297, https://doi.org/10.1016/S0021-9673(97)00453-6
. [all data]
Vinogradov, 2004
Vinogradov, B.A.,
Production, composition, properties and application of essential oils, 2004, retrieved from http://viness.narod.ru. [all data]
Zenkevich, 1999
Zenkevich, I.G.,
Analytical Parameters of Components of essential Oils for their Gas Chromatographic and Chromato-Mass-Spectral Identification. Acetates of Terpene Alcohols,
Rastitelnye Resursy (Plant Resources), 1999, 35, 1, 30-37. [all data]