N,N'-di-sec-Butyl-p-phenylenediamine
- Formula: C14H24N2
- Molecular weight: 220.3538
- IUPAC Standard InChIKey: FSWDLYNGJBGFJH-UHFFFAOYSA-N
- CAS Registry Number: 101-96-2
- Chemical structure:
View 3d structure (requires JavaScript / HTML 5) - Other names: 1,4-Bis(sec-butylamino)benzene; 1,4-Benzenediamine, N,N'-bis(1-methylpropyl)-; p-Phenylenediamine, N,N'-di-sec-butyl-; Antioxidant 22; Du Pont Gasoline Antioxidant No. 22; N,N'-Di-sec-butyl-p-phenyldiamine; N,N'-Di-sec-butylparaphenylenediamine; Tenamene 2; Topanol M; N,N'-Di-sek.butyl-p-fenylendiamin; N,N'-Di-s-butyl-p-phenylenediamine; N,N'-Di-sec-butyl-1,4-benzenediamine; Kerobit BPD; N,N'-Bis(1-methylpropyl)-1,4-benzenediamine; Naugalube 403; 1,4-Benzenediamine, N1,N4-bis(1-methylpropyl)-; NSC 68417; Santoflex 44; UOP 5

Phase change data

Data compiled as indicated in comments:
BS - Robert L. Brown and Stephen E. Stein
AC - William E. Acree, Jr., James S. Chickos
Reduced pressure boiling point
Tboil (K) | Pressure (bar) | Reference | Comment |
---|---|---|---|
395. to 397. | 0.00001 | Frinton Laboratories Inc., 1986 | BS |
Enthalpy of vaporization
ΔvapH (kJ/mol) | Temperature (K) | Method | Reference | Comment |
---|---|---|---|---|
70.3 | 385. | A | Stephenson and Malanowski, 1987 | Based on data from 370. to 507. K.; AC |

References

Frinton Laboratories Inc., 1986
Frinton Laboratories Inc.,
Catalog Number 11, Frinton Laboratories Inc., Vineland, NJ, 1986, 99. [all data]
Stephenson and Malanowski, 1987
Stephenson, Richard M.; Malanowski, Stanislaw,
Handbook of the Thermodynamics of Organic Compounds, 1987, https://doi.org/10.1007/978-94-009-3173-2
. [all data]