Naphthalene, 1,2-dihydro-3-methoxy-4-methyl-
- Formula: C12H14O
- Molecular weight: 174.2390
- IUPAC Standard InChIKey: NSRHWGCYVHKKNH-UHFFFAOYSA-N
- CAS Registry Number: 101948-79-2
- Chemical structure:
View 3d structure (requires JavaScript / HTML 5) - Permanent link for this species. Use this link for bookmarking this species for future reference.

Reaction thermochemistry data

Data compiled by: Hussein Y. Afeefy, Joel F. Liebman, and Stephen E. Stein
Individual Reactions
By formula: C12H14O = C12H14O
Quantity | Value | Units | Method | Reference | Comment |
---|---|---|---|---|---|
ΔrH° | -0.5 ± 0.2 | kcal/mol | Eqk | Taskinen and Kuusisto, 1985 | liquid phase; solvent: Cyclohexane |

References

Taskinen and Kuusisto, 1985
Taskinen, E.; Kuusisto, M.,
Thermodynamics of vinyl ethers. XXVIII. Effects of steric strain on the stability of a C=C-Ph system,
Acta Chem. Scand., Ser. B, 1985, 39, 495-499. [all data]