Benzene, 1-(2-methyoxy-1-propenyl)-3-methyl-, (Z)-
- Formula: C11H14O
- Molecular weight: 162.2283
- IUPAC Standard InChIKey: IKQRYJRRCQHMOX-CSKARUKUSA-N
- CAS Registry Number: 101948-73-6
- Chemical structure:
View 3d structure (requires JavaScript / HTML 5) - Permanent link for this species. Use this link for bookmarking this species for future reference.

Reaction thermochemistry data

Data compiled by: Hussein Y. Afeefy, Joel F. Liebman, and Stephen E. Stein
Individual Reactions
By formula: C11H14O = C11H14O
Quantity | Value | Units | Method | Reference | Comment |
---|---|---|---|---|---|
ΔrH° | -1.4 ± 0.41 | kcal/mol | Eqk | Taskinen and Kuusisto, 1985 | liquid phase; solvent: Cyclohexane |
ΔrH° | 1.9 ± 0.1 | kcal/mol | Eqk | Taskinen and Kuusisto, 1985 | liquid phase; solvent: Cyclohexane |
By formula: C11H14O = C11H14O
Quantity | Value | Units | Method | Reference | Comment |
---|---|---|---|---|---|
ΔrH° | -0.0 ± 0.1 | kcal/mol | Eqk | Taskinen and Kuusisto, 1985 | liquid phase; solvent: Cyclohexane |

References

Taskinen and Kuusisto, 1985
Taskinen, E.; Kuusisto, M.,
Thermodynamics of vinyl ethers. XXVIII. Effects of steric strain on the stability of a C=C-Ph system,
Acta Chem. Scand., Ser. B, 1985, 39, 495-499. [all data]