Cyclohexanamine, N-cyclohexyl-
- Formula: C12H23N
- Molecular weight: 181.3177
- IUPAC Standard InChIKey: XBPCUCUWBYBCDP-UHFFFAOYSA-N
- CAS Registry Number: 101-83-7
- Chemical structure:
View 3d structure (requires JavaScript / HTML 5) - Other names: Dicyclohexylamine; Dodecahydrodiphenylamine; N-Cyclohexylcyclohexanamine; N,N-Dicyclohexylamine; Cyclohexylcyclohexanamine; Dicyklohexylamin; DCH; N-Cyclohexyl-cyclohexylamine; DCHA; Dicha; N,N-Diclohexylamine; UN 2565; Aminodicyclohexane; Bis(cyclohexyl)amine; NSC 3399

Condensed phase thermochemistry data

Data compiled by: Hussein Y. Afeefy, Joel F. Liebman, and Stephen E. Stein
Quantity | Value | Units | Method | Reference | Comment |
---|---|---|---|---|---|
ΔfH°liquid | -226.8 ± 2.7 | kJ/mol | Ccr | Gutner, Masalitinova, et al., 1982 | |
Quantity | Value | Units | Method | Reference | Comment |
ΔcH°liquid | -7782.4 ± 2.7 | kJ/mol | Ccr | Gutner, Masalitinova, et al., 1982 |

Phase change data

Data compiled as indicated in comments:
BS - Robert L. Brown and Stephen E. Stein
TRC - Thermodynamics Research Center, NIST Boulder Laboratories, Chris Muzny director
AC - William E. Acree, Jr., James S. Chickos
Quantity | Value | Units | Method | Reference | Comment |
---|---|---|---|---|---|
Tboil | 529.2 | K | N/A | Aldrich Chemical Company Inc., 1990 | BS |
Tboil | 524.65 | K | N/A | Vogel, 1948 | Uncertainty assigned by TRC = 1.5 K; TRC |
Tboil | 522.15 | K | N/A | Winans and Adkins, 1932 | Uncertainty assigned by TRC = 6. K; TRC |
Enthalpy of vaporization
ΔvapH (kJ/mol) | Temperature (K) | Method | Reference | Comment |
---|---|---|---|---|
54.0 | 423. | A | Stephenson and Malanowski, 1987 | Based on data from 408. to 529. K.; AC |

Kovats' RI, non-polar column, isothermal

Column type | Active phase | Temperature (C) | I | Reference | Comment |
---|---|---|---|---|---|
Capillary | DB-1 | 170. | 1431.48 | Kuhn, 2001 | 30. m/0.53 mm/3. μm, He |

Van Den Dool and Kratz RI, non-polar column, custom temperature program

Column type | Active phase | I | Reference | Comment |
---|---|---|---|---|
Capillary | BP-1 | 1408. | Stowell and Wilson, 1987 | 12. m/0.22 mm/0.25 μm, He; Program: 120C => 8C/min => 270C => 25C/min => 300C |

Normal alkane RI, non-polar column, isothermal

Column type | Active phase | Temperature (C) | I | Reference | Comment |
---|---|---|---|---|---|
Capillary | Apieson L / KOH | 150. | 1437. | Caddy, Fish, et al., 1973 | |
Capillary | Apieson L / KOH | 150. | 1442. | Caddy, Fish, et al., 1973 | |
Capillary | Apieson L / KOH | 150. | 1444. | Caddy, Fish, et al., 1973 |

Normal alkane RI, non-polar column, temperature ramp

Column type | Active phase | I | Reference | Comment |
---|---|---|---|---|
Capillary | Ultra-1 | 1392. | Okumura, 1991 | 25. m/0.32 mm/0.25 μm, He, 3. K/min; Tstart: 80. C; Tend: 260. C |

Normal alkane RI, non-polar column, custom temperature program

Column type | Active phase | I | Reference | Comment |
---|---|---|---|---|
Capillary | OV-1 | 1400. | Waggott and Davies, 1984 | Hydrogen; Column length: 50. m; Column diameter: 0.32 mm; Program: not specified |

Normal alkane RI, polar column, isothermal

Column type | Active phase | Temperature (C) | I | Reference | Comment |
---|---|---|---|---|---|
Capillary | Carbowax 20M / KOH | 150. | 1663. | Caddy, Fish, et al., 1973 | |
Capillary | Carbowax 20M / KOH | 150. | 1673. | Caddy, Fish, et al., 1973 | |
Capillary | Carbowax 20M / KOH | 150. | 1683. | Caddy, Fish, et al., 1973 |

References

Gutner, Masalitinova, et al., 1982
Gutner, N.M.; Masalitinova, T.N.; Mon'yakova, O.N.; Lebedeva, N.D.,
Heats of combustion and formation of some cyclic compounds,
Termodin. Organ. Soedin., 1982, 46-49. [all data]
Aldrich Chemical Company Inc., 1990
Aldrich Chemical Company Inc.,
Catalog Handbook of Fine Chemicals, Aldrich Chemical Company, Inc., Milwaukee WI, 1990, 1. [all data]
Vogel, 1948
Vogel, A.I.,
Physical Properties and Chemical Constitution Part XXII. Some Primary Secondary and Tertiary Amines,
J. Chem. Soc., 1948, 1948, 1825. [all data]
Winans and Adkins, 1932
Winans, C.F.; Adkins, H.,
The Alkylation of Amines as Catalyzed by Nickel,
J. Am. Chem. Soc., 1932, 54, 306. [all data]
Stephenson and Malanowski, 1987
Stephenson, Richard M.; Malanowski, Stanislaw,
Handbook of the Thermodynamics of Organic Compounds, 1987, https://doi.org/10.1007/978-94-009-3173-2
. [all data]
Kuhn, 2001
Kuhn, E.R.,
Selectivity vs. polarity: the fundamentals of chromatographic separation,
J. Sep. Sci., 2001, 24, 6, 473-476, https://doi.org/10.1002/1615-9314(20010601)24:6<473::AID-JSSC473>3.0.CO;2-Y
. [all data]
Stowell and Wilson, 1987
Stowell, A.; Wilson, L.W.,
A simple approach to the interlaboratory transfer of drug retention indices determined by temperature programmed capillary gas chromatography,
J. Forensic Sci., 1987, 32, 5, 1214-1220. [all data]
Caddy, Fish, et al., 1973
Caddy, B.; Fish, F.; Scott, D.,
Chromatographic screening for drugs of abuse using capillary columds. II. Peak identification on support coated open tubular columns for a series of central nervous system stimulating drugs,
Chromatographia, 1973, 6, 7, 293-300, https://doi.org/10.1007/BF02269329
. [all data]
Okumura, 1991
Okumura, T.,
retention indices of environmental chemicals on methyl silicone capillary column,
Journal of Environmental Chemistry (Japan), 1991, 1, 2, 333-358, https://doi.org/10.5985/jec.1.333
. [all data]
Waggott and Davies, 1984
Waggott, A.; Davies, I.W.,
Identification of organic pollutants using linear temperature programmed retention indices (LTPRIs) - Part II, 1984, retrieved from http://dwi.defra.gov.uk/research/completed-research/reports/dwi0383.pdf. [all data]