CAS Reg. No. 10177-98-7
- CAS Registry Number: 10177-98-7

Reaction thermochemistry data

Data compiled by: John E. Bartmess
Individual Reactions
+ CAS Reg. No. 10177-98-7 = (
• CAS Reg. No. 10177-98-7)
By formula: H- + CAS Reg. No. 10177-98-7 = (H- • CAS Reg. No. 10177-98-7)
Quantity | Value | Units | Method | Reference | Comment |
---|---|---|---|---|---|
ΔrH° | 84. ± 17. | kJ/mol | IMRB | Hajdasz, Ho, et al., 1994 | gas phase; affinity order: Et3SiH≤Et2SiH2≤nPnSiH3≤SiH4. nPnSiH3 is 0.4±0.2 kcal/mol > Et3SiH in ΔG. Et3SiH dHf(77PR) is wrong. |
ΔrH° | 45. ± 23. | kJ/mol | IMRB | Hajdasz and Squires, 1986 | gas phase |

Ion clustering data

Data compiled by: John E. Bartmess
Clustering reactions
+ CAS Reg. No. 10177-98-7 = (
• CAS Reg. No. 10177-98-7)
By formula: H- + CAS Reg. No. 10177-98-7 = (H- • CAS Reg. No. 10177-98-7)
Quantity | Value | Units | Method | Reference | Comment |
---|---|---|---|---|---|
ΔrH° | 84. ± 17. | kJ/mol | IMRB | Hajdasz, Ho, et al., 1994 | gas phase; affinity order: Et3SiH≤Et2SiH2≤nPnSiH3≤SiH4. nPnSiH3 is 0.4±0.2 kcal/mol > Et3SiH in ΔG. Et3SiH dHf(77PR) is wrong. |
ΔrH° | 45. ± 23. | kJ/mol | IMRB | Hajdasz and Squires, 1986 | gas phase |

References

Hajdasz, Ho, et al., 1994
Hajdasz, D.J.; Ho, Y.; Squires, R.R.,
Gas-Phase Chemistry of Pentacoordinate Silicon Hydrides,
J. Am. Chem. Soc., 1994, 116, 23, 10751, https://doi.org/10.1021/ja00102a045
. [all data]
Hajdasz and Squires, 1986
Hajdasz, D.J.; Squires, R.R.,
Hypervalent silicon hydrides: SiH5-,
J. Am. Chem. Soc., 1986, 108, 3139. [all data]