1,4-Benzenediamine, N-(1-methylethyl)-N'-phenyl-
- Formula: C15H18N2
- Molecular weight: 226.3168
- IUPAC Standard InChIKey: OUBMGJOQLXMSNT-UHFFFAOYSA-N
- CAS Registry Number: 101-72-4
- Chemical structure:
View 3d structure (requires JavaScript / HTML 5) - Other names: p-Phenylenediamine, N-isopropyl-N'-phenyl-; Antioxidant IP; Antioxidant 40NA; Antioxidant 4010 NA; ASM 4010MA; Cyzone IP; Diafen FP; Diaphen FP; Elastozone 34; Flexzone 3C; Ipognox 44; N-Phenyl-N'-isopropyl-1,4-phenylenediamine; Nocrack 810NA; Nonox ZA; Orflex PP; Ozonon 3C; Permanax 115; S-IP; Santoflex IP; Santoflex 36; 4-(Isopropylamino)diphenylamine; 4-Anilino-N-isopropylaniline; 4010 NA; N-Isopropyl-N'-phenyl-p-phenylenediamine; Antigen 3C; Antigene 3C; Cyzone; N-Isopropyl-N'-fenyl-p-fenylendiamin; N-Phenyl-N'-isopropyl-p-phenylenediamine; N-2-Propyl-N'-phenyl-p-phenylenediamine; NCI-C56304; N-Fenyl-N'-isopropyl-p-fenylendiamin; N-Isopropyl-N-phenyl-p-phenylenediamine; Akrochem antioxidant pd1; Anto H; Dusantox IPPD; Flexone 3C; IPPD; N-Fenyl-N'-isopropyl-p-fenylendiamin (czech); N-Isopropyl-N'-fenyl-p-fenylendiamin(Czech); N-Isopropyl-N'-phenyl-4-phenylenediamine; Permanax IPPD; Permanex IPPD; Santoflex IPPD; Vanox 3C; Vulkanox 4010NA; 1,4-Benzenediamine, N1-(1-methylethyl)-N4-phenyl-; N-(1-Methylethyl)-N'-phenyl-1,4-benzenediamine; NA 4010; NSC 41029; Nocrac 810NA

Phase change data

Data compiled by: William E. Acree, Jr., James S. Chickos
Enthalpy of sublimation
ΔsubH (kJ/mol) | Temperature (K) | Method | Reference | Comment |
---|---|---|---|---|
120.7 | 335. | GS | Fel'dshtein and Kuz'minskii, 1971 | Based on data from 323. to 348. K. |

References

Fel'dshtein and Kuz'minskii, 1971
Fel'dshtein, L.S.; Kuz'minskii, A.S.,
Kauch. Rezina, 1971, 30, 11, 15. [all data]
Fihtengolts, et al., 1969
Fihtengolts, V.S., et al.,
Atlas of UV Absorption Spectra of Substances Used in Synthetic Rubber Manufacture, 1969, 82. [all data]