Bis(p-nitrophenyl) ether
- Formula: C12H8N2O5
- Molecular weight: 260.2023
- IUPAC Standard InChIKey: MWAGUKZCDDRDCS-UHFFFAOYSA-N
- CAS Registry Number: 101-63-3
- Chemical structure:
View 3d structure (requires JavaScript / HTML 5) - Other names: 4,4'-Dinitrodiphenyl ether; Benzene, 1,1'-oxybis[4-nitro-; p-Nitrophenyl ether; p,p'-Dinitrodiphenyl ether; Bis(4-nitrophenyl) ether; Di-4-nitrophenyl ether; Ether, bis(p-nitrophenyl); Ether, bis(4-nitrophenyl); Oxybis(4-nitrobenzene); 4,4'-Dinitrodiphenyl oxide; NSC 8740

Condensed phase thermochemistry data

Data compiled by: Eugene S. Domalski and Elizabeth D. Hearing
Constant pressure heat capacity of solid
Cp,solid (J/mol*K) | Temperature (K) | Reference | Comment |
---|---|---|---|
421.7 | 298. | Marchidan and Ciopec, 1978 | T = 298 to 491 K. Values for solid seem odd; minimum at 345 K of 276 J/mol*K, rising to 552 J/mol at 410 K. |

Phase change data

Data compiled as indicated in comments:
AC - William E. Acree, Jr., James S. Chickos
DH - Eugene S. Domalski and Elizabeth D. Hearing
Enthalpy of fusion
ΔfusH (kJ/mol) | Temperature (K) | Reference | Comment |
---|---|---|---|
10.29 | 418.2 | Acree, 1993 | AC |
10.295 | 418.2 | Marchidan and Ciopec, 1978 | DH |
Entropy of fusion
ΔfusS (J/mol*K) | Temperature (K) | Reference | Comment |
---|---|---|---|
24.6 | 418.2 | Marchidan and Ciopec, 1978 | DH |

References

Marchidan and Ciopec, 1978
Marchidan, D.I.; Ciopec, M.,
Relative enthalpies and related thermodynamic functions of some organic compounds by drop calorimetry,
J. Therm. Anal., 1978, 14, 131-150. [all data]
Acree, 1993
Acree, William E.,
Thermodynamic properties of organic compounds,
Thermochimica Acta, 1993, 219, 97-104, https://doi.org/10.1016/0040-6031(93)80486-T
. [all data]