3,3-Diethoxy-1-propyne
- Formula: C7H12O2
- Molecular weight: 128.1690
- IUPAC Standard InChIKey: RGUXEWWHSQGVRZ-UHFFFAOYSA-N
- CAS Registry Number: 10160-87-9
- Chemical structure:
View 3d structure (requires JavaScript / HTML 5) - Other names: 1-Propyne, 3,3-diethoxy-; Propargylaldehyde diethyl acetal; 3,3-diethoxypropyne

Phase change data

Data compiled by: Robert L. Brown and Stephen E. Stein
Reduced pressure boiling point
Tboil (K) | Pressure (bar) | Reference |
---|---|---|
311. | 0.013 | Farchan Laboratories, 1990 |

References

Farchan Laboratories, 1990
Farchan Laboratories,
Research Chemicals Catalog, Farchan Laboratories, Gainesville, FL, 1990, 91. [all data]