1,4-Benzenediamine, N-phenyl-
- Formula: C12H12N2
- Molecular weight: 184.2371
- IUPAC Standard InChIKey: ATGUVEKSASEFFO-UHFFFAOYSA-N
- CAS Registry Number: 101-54-2
- Chemical structure:
View 3d structure (requires JavaScript / HTML 5) - Other names: p-Phenylenediamine, N-phenyl-; p-(Phenylamino)aniline; p-Aminodiphenylamine; p-Anilinoaniline; C.I. Developer 15; C.I. Oxidation Base 2; C.I. 76085; Diphenyl Black; Diphenylamine, 4-amino-; Luxan Black R; N-Phenyl-p-aminoaniline; N-Phenyl-p-phenylenediamine; N-Phenyl-1,4-phenylenediamine; N-4'-Bianiline; Peltol BR; Peltol BR II; Semidin; Semidine; Variamine Blue RT; 4-Aminodiphenylamine; p-Aminodifenylamin; p-Semidine; Acna Black DF Base; Azosalt R; C.I. Azoic Diazo Component 22; C.I. 37240; Diphenylamine, p-amino-; Fast Blue R Salt; Naphthoelan Navy Blue; Oxy Acid Black Base; Variamine Blue Salt RT; N-Fenyl-p-fenylendiamin; NCI-C02233; N-Phenyl-1,4-benzenediamine; 4-(Phenylamino)aniline; UBOB; 1,4-Benzenediamine, N1-phenyl-; N-(4-Aminophenyl)aniline; NSC 3401

Phase change data

Data compiled by: Robert L. Brown and Stephen E. Stein
Quantity | Value | Units | Method | Reference | Comment |
---|---|---|---|---|---|
Tboil | 627. | K | N/A | Buckingham and Donaghy, 1982 | |
Quantity | Value | Units | Method | Reference | Comment |
Tfus | 339. | K | N/A | Buckingham and Donaghy, 1982 |
Reduced pressure boiling point
Tboil (K) | Pressure (bar) | Reference |
---|---|---|
428. | 0.000035 | Buckingham and Donaghy, 1982 |

References

Buckingham and Donaghy, 1982
Buckingham, J.; Donaghy, S.M.,
Dictionary of Organic Compounds: Fifth Edition, Chapman and Hall, New York, 1982, 1. [all data]
Lang (editor), 1975
Lang (editor), L.,
Absorption Spectra in the Ultraviolet and Visible Region, 1975, 20, 183. [all data]