1,3-Dioxolane, 2-(phenylmethyl)-
- Formula: C10H12O2
- Molecular weight: 164.2011
- IUPAC Standard InChIKey: SSZACLYPEFCREM-UHFFFAOYSA-N
- CAS Registry Number: 101-49-5
- Chemical structure:
View 3d structure (requires JavaScript / HTML 5) - Other names: 1,3-Dioxolane, 2-benzyl-; Phenylacetaldehyde ethylene acetal; Phenylacetaldehyde glycol acetal; 2-Benzyl-1,3-dioxolane; Phenylacetaldehyde ethylene glycol acetal; 2-Benzyldioxolan

Phase change data

Data compiled by: Robert L. Brown and Stephen E. Stein
Reduced pressure boiling point
Tboil (K) | Pressure (bar) | Reference |
---|---|---|
390.7 | 0.016 | Aldrich Chemical Company Inc., 1990 |

Kovats' RI, non-polar column, isothermal

Column type | Active phase | Temperature (C) | I | Reference | Comment |
---|---|---|---|---|---|
Capillary | SE-30 | 100. | 1276.9 | Tudor, 1997 | 40. m/0.35 mm/0.35 μm |

Kovats' RI, polar column, isothermal

Column type | Active phase | Temperature (C) | I | Reference | Comment |
---|---|---|---|---|---|
Capillary | Carbowax 20M | 150. | 1940. | Tudor, Moldovan, et al., 1999 | Phase thickness: 0.45 μm |
Capillary | Carbowax 20M | 150. | 1910. | Tudor, Moldovan, et al., 1999 | Phase thickness: 0.08 μm |

References

Aldrich Chemical Company Inc., 1990
Aldrich Chemical Company Inc.,
Catalog Handbook of Fine Chemicals, Aldrich Chemical Company, Inc., Milwaukee WI, 1990, 1. [all data]
Tudor, 1997
Tudor, E.,
Temperature dependence of the retention index for perfumery compounds on a SE-30 glass capillary column. I. Linear equations,
J. Chromatogr. A, 1997, 779, 1-2, 287-297, https://doi.org/10.1016/S0021-9673(97)00453-6
. [all data]
Tudor, Moldovan, et al., 1999
Tudor, E.; Moldovan, D.; Zârna, N.,
Temperature dependence of the retention index for perfumery compounds on two carbowax-20M glass capillary columns with different film thickness. 2,
Rev. Roum. Chim., 1999, 44, 7, 665-675. [all data]