1-Dodecanesulfonyl chloride
- Formula: C12H25ClO2S
- Molecular weight: 268.844
- IUPAC Standard InChIKey: PBULHKIPTBIZHO-UHFFFAOYSA-N
- CAS Registry Number: 10147-40-7
- Chemical structure:
View 3d structure (requires JavaScript / HTML 5) - Other names: 1-Dodecanesulphonyl chloride; dodecane-1-sulphonyl chloride

Reaction thermochemistry data

Data compiled by: Hussein Y. Afeefy, Joel F. Liebman, and Stephen E. Stein
Individual Reactions
+
= C12H26O3S +
By formula: C12H25ClO2S + H2O = C12H26O3S + HCl
Quantity | Value | Units | Method | Reference | Comment |
---|---|---|---|---|---|
ΔrH° | -1. ± 8.4 | kJ/mol | Cm | Roth and Rist-Schumacher, 1944 | solid phase |

References

Roth and Rist-Schumacher, 1944
Roth, W.A.; Rist-Schumacher, E.,
Beitrag zur thermochemie der sulfonsauren und saurechlorid,
Z. Electrochem., 1944, 50, 7-9. [all data]