1-Propanesulfonyl chloride
- Formula: C3H7ClO2S
- Molecular weight: 142.604
- IUPAC Standard InChIKey: KPBSJEBFALFJTO-UHFFFAOYSA-N
- CAS Registry Number: 10147-36-1
- Chemical structure:
View 3d structure (requires JavaScript / HTML 5) - Other names: Propane-1-sulfonyl chloride; propanesulphonyl chloride

Phase change data

Data compiled as indicated in comments:
BS - Robert L. Brown and Stephen E. Stein
AC - William E. Acree, Jr., James S. Chickos
Quantity | Value | Units | Method | Reference | Comment |
---|---|---|---|---|---|
Tboil | 448. to 453. | K | N/A | Frinton Laboratories Inc., 1986 | BS |
Enthalpy of vaporization
ΔvapH (kJ/mol) | Temperature (K) | Method | Reference | Comment |
---|---|---|---|---|
52.3 | 288. | N/A | Dykyj, Svoboda, et al., 1999 | Based on data from 273. to 362. K.; AC |
49.9 | 377. | N/A | Dykyj, Svoboda, et al., 1999 | Based on data from 362. to 464. K.; AC |
60.1 | 258. | A | Stephenson and Malanowski, 1987 | Based on data from 243. to 273. K. See also Dykyj, Svoboda, et al., 1999.; AC |

References

Frinton Laboratories Inc., 1986
Frinton Laboratories Inc.,
Catalog Number 11, Frinton Laboratories Inc., Vineland, NJ, 1986, 99. [all data]
Dykyj, Svoboda, et al., 1999
Dykyj, J.; Svoboda, J.; Wilhoit, R.C.; Frenkel, M.L.; Hall, K.R.,
Vapor Pressure of Chemicals: Part A. Vapor Pressure and Antoine Constants for Hydrocarbons and Sulfur, Selenium, Tellurium and Hydrogen Containing Organic Compounds, Springer, Berlin, 1999, 373. [all data]
Stephenson and Malanowski, 1987
Stephenson, Richard M.; Malanowski, Stanislaw,
Handbook of the Thermodynamics of Organic Compounds, 1987, https://doi.org/10.1007/978-94-009-3173-2
. [all data]