5-ethyl-4-isobutyl-2-methylnonane
- Formula: C16H34
- Molecular weight: 226.4412
- IUPAC Standard InChIKey: AGWYHZNVISWYOA-UHFFFAOYSA-N
- CAS Registry Number: 101432-90-0
- Chemical structure:
View 3d structure (requires JavaScript / HTML 5) - Permanent link for this species. Use this link for bookmarking this species for future reference.

Phase change data

Data compiled by: Thermodynamics Research Center, NIST Boulder Laboratories, Chris Muzny director
Quantity | Value | Units | Method | Reference | Comment |
---|---|---|---|---|---|
Tfus | 183. | K | N/A | Petrov, Melekhin, et al., 1955 | Uncertainty assigned by TRC = 5. K |

References

Petrov, Melekhin, et al., 1955
Petrov, A.D.; Melekhin, V.M.; Nefedov, O.M.,
Bull. Acad. Sci. USSR, 1955, 1955, 339. [all data]