Fenuron
- Formula: C9H12N2O
- Molecular weight: 164.2044
- IUPAC Standard InChIKey: XXOYNJXVWVNOOJ-UHFFFAOYSA-N
- CAS Registry Number: 101-42-8
- Chemical structure:
View 3d structure (requires JavaScript / HTML 5) - Other names: Urea, N,N-dimethyl-N'-phenyl-; Urea, 1,1-dimethyl-3-phenyl-; Dibar; Dybar; N-Phenyl-N',N'-dimethylurea; N,N-Dimethyl-N'-phenylurea; PUD (Herbicide); 1-Phenyl-3,3-dimethylurea; 1,1-Dimethyl-3-phenylurea; 3-Phenyl-1,1-dimethylurea; Fenidin; Fenulon; PDU; PUD; Falisilvan; Amicure UR; Dyhard RU 300; Dyhard UR 300; Fikure 62U; Omicure 94

Condensed phase thermochemistry data

Data compiled by: Hussein Y. Afeefy, Joel F. Liebman, and Stephen E. Stein
Quantity | Value | Units | Method | Reference | Comment |
---|---|---|---|---|---|
ΔfH°solid | -203. ± 4.2 | kJ/mol | Ccb | Selivanov and Konstantinov, 1975 | |
Quantity | Value | Units | Method | Reference | Comment |
ΔcH°solid | -5054.3 ± 4.2 | kJ/mol | Ccb | Selivanov and Konstantinov, 1975 |

Phase change data

Data compiled as indicated in comments:
TRC - Thermodynamics Research Center, NIST Boulder Laboratories, Chris Muzny director
AC - William E. Acree, Jr., James S. Chickos
Quantity | Value | Units | Method | Reference | Comment |
---|---|---|---|---|---|
Tfus | 406.38 | K | N/A | Donnelly, Drewes, et al., 1990 | Uncertainty assigned by TRC = 0.2 K; TRC |
Tfus | 406.0 | K | N/A | Plato and Glasgow, 1969 | Uncertainty assigned by TRC = 0.2 K; TRC |
Enthalpy of fusion
ΔfusH (kJ/mol) | Temperature (K) | Method | Reference | Comment |
---|---|---|---|---|
22.81 | 404.8 | DSC | Acree, 1991 | See also Donnelly, Drewes, et al., 1990, 2.; AC |

Reaction thermochemistry data

Data compiled by: Hussein Y. Afeefy, Joel F. Liebman, and Stephen E. Stein
Individual Reactions
By formula: C9H12N2O = C7H5NO + C2H7N
Quantity | Value | Units | Method | Reference | Comment |
---|---|---|---|---|---|
ΔrH° | 134.2 ± 2.9 | kJ/mol | Eqk | Chimishkyan, Svetlova, et al., 1984 | solid phase |

References

Selivanov and Konstantinov, 1975
Selivanov, V.D.; Konstantinov, I.I.,
Thermochemistry of chloroaryl isocyanates,
Russ. J. Phys. Chem. (Engl. Transl.), 1975, 49, 620-621. [all data]
Donnelly, Drewes, et al., 1990
Donnelly, J.R.; Drewes, L.A.; Johnson, R.L.; Munslow, W.D.; Knapp, K.K.; Sovocool, G.W.,
Purity and heat of fusion data for environmental standards as determined by differential scanning calorimetry,
Thermochim. Acta, 1990, 167, 2, 155, https://doi.org/10.1016/0040-6031(90)80476-F
. [all data]
Plato and Glasgow, 1969
Plato, C.; Glasgow, A.R., Jr.,
Differential scanning calorimetry as a general method for determining the purity and heat of fusion of high-purity organic chemicals. Application to 95 compounds,
Anal. Chem., 1969, 41, 2, 330, https://doi.org/10.1021/ac60271a041
. [all data]
Acree, 1991
Acree, William E.,
Thermodynamic properties of organic compounds: enthalpy of fusion and melting point temperature compilation,
Thermochimica Acta, 1991, 189, 1, 37-56, https://doi.org/10.1016/0040-6031(91)87098-H
. [all data]
Donnelly, Drewes, et al., 1990, 2
Donnelly, J.R.; Drewes, L.A.; Johnson, R.L.; Munslow, W.D.; Knapp, K.K.; Sovocool, G.W.,
Purity and heat of fusion data for environmental standards as determined by differential scanning calorimetry,
Thermochimica Acta, 1990, 167, 2, 155-187, https://doi.org/10.1016/0040-6031(90)80476-F
. [all data]
Chimishkyan, Svetlova, et al., 1984
Chimishkyan, A.L.; Svetlova, L.P.; Leonova, T.V.; Gluyaev, N.D.,
Thermal decomposition of substituted ureas,
J. Gen. Chem. USSR, 1984, 54, 1317-1320. [all data]