2H-Pyran, tetrahydro-2-methyl-

Normal alkane RI, non-polar column, temperature ramp

View large format table.

Column type Active phase I Reference Comment
CapillaryHP-5 MS838.Sandoval-Montemayor, Garcia, et al., 201225. m/0.20 mm/0.30 μm, Helium, 40. C @ 2. min, 10. K/min, 260. C @ 20. min

Normal alkane RI, non-polar column, custom temperature program

View large format table.

Column type Active phase I Reference Comment
CapillaryMethyl Silicone751.Farkas, Héberger, et al., 2004Program: not specified

References

Sandoval-Montemayor, Garcia, et al., 2012
Sandoval-Montemayor, N.E.; Garcia, A.; Elizondo-Trevino, E.; Garza-Gonzales, E.; Alvarez, L.; Camacho-Corona, M. delR., Chemical composition of hexane extract of Citrus aurantifolia and anti-mycobacterium tuberculosis activity of some of its constituents, Molecules, 2012, 17, 12, 11173-11184, https://doi.org/10.3390/molecules170911173 . [all data]

Farkas, Héberger, et al., 2004
Farkas, O.; Héberger, K.; Zenkevich, I.G., Quantitative structure-retention relationships. XIV. Prediction of gas chromatographic retention indices for saturated O-, N-, and S-heterocyclic compounds, Chemom. Intell. Lab. Syst., 2004, 72, 2, 173-184, https://doi.org/10.1016/j.chemolab.2004.01.012 . [all data]