Benzenemethanimine, α-phenyl-
- Formula: C13H11N
- Molecular weight: 181.2331
- IUPAC Standard InChIKey: SXZIXHOMFPUIRK-UHFFFAOYSA-N
- CAS Registry Number: 1013-88-3
- Chemical structure:
View 3d structure (requires JavaScript / HTML 5) - Other names: Benzophenone imine

Phase change data

Data compiled as indicated in comments:
BS - Robert L. Brown and Stephen E. Stein
AC - William E. Acree, Jr., James S. Chickos
Quantity | Value | Units | Method | Reference | Comment |
---|---|---|---|---|---|
ΔvapH° | 75.7 ± 1.0 | kJ/mol | GS | Verevkin, Morgenthaler, et al., 1997 | Based on data from 308. to 338. K.; AC |
Reduced pressure boiling point
Tboil (K) | Pressure (bar) | Reference | Comment |
---|---|---|---|
425.2 | 0.013 | Aldrich Chemical Company Inc., 1990 | BS |
Enthalpy of vaporization
ΔvapH (kJ/mol) | Temperature (K) | Method | Reference | Comment |
---|---|---|---|---|
74.2 ± 1.0 | 323. | GS | Verevkin, Morgenthaler, et al., 1997 | Based on data from 308. to 338. K.; AC |
62.3 | 388. | A | Stephenson and Malanowski, 1987 | Based on data from 373. to 422. K.; AC |

References

Verevkin, Morgenthaler, et al., 1997
Verevkin, Sergey P.; Morgenthaler, Jens; Rüchardt, Christoph,
Thermochemistry of imines: experimental standard molar enthalpies of formation,
The Journal of Chemical Thermodynamics, 1997, 29, 10, 1175-1183, https://doi.org/10.1006/jcht.1997.0242
. [all data]
Aldrich Chemical Company Inc., 1990
Aldrich Chemical Company Inc.,
Catalog Handbook of Fine Chemicals, Aldrich Chemical Company, Inc., Milwaukee WI, 1990, 1. [all data]
Stephenson and Malanowski, 1987
Stephenson, Richard M.; Malanowski, Stanislaw,
Handbook of the Thermodynamics of Organic Compounds, 1987, https://doi.org/10.1007/978-94-009-3173-2
. [all data]