ethyl ethyl(phenyl)carbamate
- Formula: C11H15NO2
- Molecular weight: 193.2423
- IUPAC Standard InChIKey: XEFYPTRGVWLMHB-UHFFFAOYSA-N
- CAS Registry Number: 1013-75-8
- Chemical structure:
View 3d structure (requires JavaScript / HTML 5) - Other names: Carbamic acid, ethylphenyl-, ethyl ester

Condensed phase thermochemistry data

Data compiled by: Hussein Y. Afeefy, Joel F. Liebman, and Stephen E. Stein
Quantity | Value | Units | Method | Reference | Comment |
---|---|---|---|---|---|
ΔfH°liquid | -420.5 ± 5.9 | kJ/mol | Ccb | Medard and Thomas, 1954 | Heat of combustion corrected for pressure |
ΔfH°liquid | -402.8 | kJ/mol | Ccb | Medard, 1954 | Heat of combustion corrected for pressure |
Quantity | Value | Units | Method | Reference | Comment |
ΔcH°liquid | -6051.7 ± 5.9 | kJ/mol | Ccb | Medard and Thomas, 1954 | Heat of combustion corrected for pressure |
ΔcH°liquid | -6069.60 | kJ/mol | Ccb | Medard, 1954 | Heat of combustion corrected for pressure |
Quantity | Value | Units | Method | Reference | Comment |
ΔfH°solid | -404. | kJ/mol | Ccb | Schmidt and Becker, 1933 | |
Quantity | Value | Units | Method | Reference | Comment |
ΔcH°solid | -6062.6 | kJ/mol | Ccb | Schmidt and Becker, 1933 |

References

Medard and Thomas, 1954
Medard, L.; Thomas, M.,
Chaleurs de combustion de vingt-quatre substances explosives ou apparentees a des explosifs,
Mem. Poudres, 1954, 36, 97-127. [all data]
Medard, 1954
Medard, L.,
Tables thermochimiques a l'usage des techniciens des substances explosives,
Mem. Artillerie Fr. Sci. Tech. Armement, 1954, 28, 415-492. [all data]
Schmidt and Becker, 1933
Schmidt, V.A.; Becker, F.,
Die Bildungswarme von Nitrocellulofen, Nitroglycerin und anderen widuigen Beltandteilen von Treibmitteln,
Z. Gesamte Schiess Sprengstoffwes., 1933, 33, 280-282. [all data]