Triallyl cyanurate
- Formula: C12H15N3O3
- Molecular weight: 249.2658
- IUPAC Standard InChIKey: BJELTSYBAHKXRW-UHFFFAOYSA-N
- CAS Registry Number: 101-37-1
- Chemical structure:
View 3d structure (requires JavaScript / HTML 5) - Other names: 2,4,6-Triallyloxy-1,3,5-triazine; 2,4,6-Tris(allyloxy)-s-triazine; 2,4,6-Tris(allyloxy)-1,3,5-triazine; 1,3,5-Triazine, 2,4,6-tris(2-propenyloxy)-; s-Triazine, 2,4,6-tris(allyloxy)-; Cyanuric acid, tri-2-propenyl ester; Cyanuric acid, triallyl ester; Triallyl cyanaurate; 2,4,6-Tri(allyloxy)-s-triazine; 2,4,6-Tris(allyloxy)triazine; Perkalink 300; 1,3,5-Triazine, 2,4,6-tris(2-propen-1-yloxy)-; Activator OC; NSC 4804; Perkalink 300-50D; Rhenofit TAC; TAC

Phase change data

Data compiled by: Thermodynamics Research Center, NIST Boulder Laboratories, Chris Muzny director
Quantity | Value | Units | Method | Reference | Comment |
---|---|---|---|---|---|
Tfus | 300.47 | K | N/A | Witschonke, 1954 | Uncertainty assigned by TRC = 0.25 K |
Tfus | 300.7 | K | N/A | Witschonke, 1954 | Uncertainty assigned by TRC = 0.2 K |

References

Witschonke, 1954
Witschonke, C.R.,
Freezing point and purity data for some organic compounds,
Anal. Chem., 1954, 26, 562-4. [all data]