Phenanthrene, 1,2,3,4-tetrahydro-
- Formula: C14H14
- Molecular weight: 182.2610
- IUPAC Standard InChIKey: UXNCDAQNSQBHEN-UHFFFAOYSA-N
- CAS Registry Number: 1013-08-7
- Chemical structure:
View 3d structure (requires JavaScript / HTML 5) - Other names: 1,2,3,4-Tetrahydrophenanthrene

Gas phase thermochemistry data

Data compiled as indicated in comments:
ALS - Hussein Y. Afeefy, Joel F. Liebman, and Stephen E. Stein
GT - Glushko Thermocenter, Russian Academy of Sciences, Moscow
Quantity | Value | Units | Method | Reference | Comment |
---|---|---|---|---|---|
ΔfH°gas | 92.3 ± 1.3 | kJ/mol | Ccb | Shaw, David, et al., 1977 | Unpublished W.D.Good; ALS |
Constant pressure heat capacity of gas
Cp,gas (J/mol*K) | Temperature (K) | Reference | Comment |
---|---|---|---|
45.64 | 50. | Dorofeeva O.V., 1988 | Recommended values were calculated statistically mechanically using force field approximation for polycyclic aromatic hydrocarbons to estimate the needed vibrational frequencies (see also [ Dorofeeva O.V., 1986]). These functions are reproduced in the reference book [ Frenkel M., 1994].; GT |
70.30 | 100. | ||
98.52 | 150. | ||
130.35 | 200. | ||
182.21 | 273.15 | ||
200.6 ± 2.5 | 298.15 | ||
201.97 | 300. | ||
273.01 | 400. | ||
334.35 | 500. | ||
384.65 | 600. | ||
425.70 | 700. | ||
459.54 | 800. | ||
487.73 | 900. | ||
511.42 | 1000. | ||
531.45 | 1100. | ||
548.48 | 1200. | ||
563.03 | 1300. | ||
575.51 | 1400. | ||
586.27 | 1500. |

Condensed phase thermochemistry data

Data compiled by: Eugene S. Domalski and Elizabeth D. Hearing
Quantity | Value | Units | Method | Reference | Comment |
---|---|---|---|---|---|
S°liquid | 286.60 | J/mol*K | N/A | Chirico, Hossenloop, et al., 1987 |
Constant pressure heat capacity of liquid
Cp,liquid (J/mol*K) | Temperature (K) | Reference | Comment |
---|---|---|---|
278.26 | 298.15 | Chirico, Hossenloop, et al., 1987 | T = 5 to 430 K. |

Phase change data

Data compiled as indicated in comments:
BS - Robert L. Brown and Stephen E. Stein
TRC - Thermodynamics Research Center, NIST Boulder Laboratories, Chris Muzny director
CAL - James S. Chickos, William E. Acree, Jr., Joel F. Liebman, Students of Chem 202 (Introduction to the Literature of Chemistry), University of Missouri -- St. Louis
DH - Eugene S. Domalski and Elizabeth D. Hearing
Quantity | Value | Units | Method | Reference | Comment |
---|---|---|---|---|---|
Ttriple | 302.550 | K | N/A | Chirico, Gammon, et al., 1994 | Crystal phase 1 phase; Uncertainty assigned by TRC = 0.005 K; TRC |
Ttriple | 302.560 | K | N/A | Chirico, Hossenlopp, et al., 1987 | Crystal phase 1 phase; Uncertainty assigned by TRC = 0.01 K; TRC |
Reduced pressure boiling point
Tboil (K) | Pressure (bar) | Reference | Comment |
---|---|---|---|
446.2 | 0.015 | Weast and Grasselli, 1989 | BS |
Entropy of fusion
ΔfusS (J/mol*K) | Temperature (K) | Reference | Comment |
---|---|---|---|
36.91 | 302.6 | Chirico, Gammon, et al., 1994, 2 | CAL |
20.44 | 285. | ||
5.92 | 298. |
Temperature of phase transition
Ttrs (K) | Initial Phase | Final Phase | Reference | Comment |
---|---|---|---|---|
302.560 | crystaline, I | liquid | Chirico, Hossenloop, et al., 1987 | DH |
Enthalpy of phase transition
ΔHtrs (kJ/mol) | Temperature (K) | Initial Phase | Final Phase | Reference | Comment |
---|---|---|---|---|---|
0.213 | 282.5 | crystaline, III | crystaline, II | Chirico, Hossenloop, et al., 1987 | DH |
1.3442 | 298.0 | crystaline, II | crystaline, I | Chirico, Hossenloop, et al., 1987 | DH |
Entropy of phase transition
ΔStrs (J/mol*K) | Temperature (K) | Initial Phase | Final Phase | Reference | Comment |
---|---|---|---|---|---|
0.75 | 282.5 | crystaline, III | crystaline, II | Chirico, Hossenloop, et al., 1987 | DH |
4.44 | 298.0 | crystaline, II | crystaline, I | Chirico, Hossenloop, et al., 1987 | DH |

Reaction thermochemistry data

Data compiled by: Hussein Y. Afeefy, Joel F. Liebman, and Stephen E. Stein
Individual Reactions
By formula: 2H2 + C14H10 = C14H14
Quantity | Value | Units | Method | Reference | Comment |
---|---|---|---|---|---|
ΔrH° | -130. | kJ/mol | Eqk | Frye, 1962 | gas phase |

Van Den Dool and Kratz RI, non-polar column, temperature ramp

Column type | Active phase | I | Reference | Comment |
---|---|---|---|---|
Capillary | DB-5 | 1737.6 | Song, Lai, et al., 2003 | 30. m/0.25 mm/0.25 μm, He, 2. K/min; Tstart: 40. C; Tend: 310. C |
Capillary | DB-5 | 1755.2 | Song, Lai, et al., 2003 | 30. m/0.25 mm/0.25 μm, He, 4. K/min; Tstart: 40. C; Tend: 310. C |
Capillary | DB-5 | 1767.7 | Song, Lai, et al., 2003 | 30. m/0.25 mm/0.25 μm, He, 6. K/min; Tstart: 40. C; Tend: 310. C |
Capillary | DB-5 | 1737.6 | Lai and Song, 1995 | 30. m/0.25 mm/0.25 μm, He, 2. K/min; Tstart: 40. C; Tend: 310. C |
Capillary | DB-5 | 1755.2 | Lai and Song, 1995 | 30. m/0.25 mm/0.25 μm, He, 4. K/min; Tstart: 40. C; Tend: 310. C |
Capillary | DB-5 | 1767.7 | Lai and Song, 1995 | 30. m/0.25 mm/0.25 μm, He, 6. K/min; Tstart: 40. C; Tend: 310. C |

Normal alkane RI, non-polar column, isothermal

Column type | Active phase | Temperature (C) | I | Reference | Comment |
---|---|---|---|---|---|
Packed | Polydimethyl siloxane | 183. | 1772. | Ferrand, 1962 |

Lee's RI, non-polar column, temperature ramp

Column type | Active phase | I | Reference | Comment |
---|---|---|---|---|
Capillary | SE-52 | 297.21 | Lee, Vassilaros, et al., 1979 | 12. m/0.3 mm/0.34 μm, He, 2. K/min; Tstart: 50. C; Tend: 250. C |

Lee's RI, non-polar column, custom temperature program

Column type | Active phase | I | Reference | Comment |
---|---|---|---|---|
Capillary | DB-5MS | 296. | Aracil, Font, et al., 2005 | Column length: 60. m; Column diameter: 0.25 mm; Program: not specified |
Capillary | SE-52 | 297.21 | Shlyakhov, 1984 | Program: not specified |

References

Shaw, David, et al., 1977
Shaw, R.G.; David, M.; Benson, S.W.,
Thermochemistry of some six-membered cyclic and polycyclic compounds related to coal,
J. Phys. Chem., 1977, 81, 1716-1729. [all data]
Dorofeeva O.V., 1988
Dorofeeva O.V.,
Thermodynamic Properties of Polycyclic Aromatic Hydrocarbons in the Gaseous Phase. Institute for High Temperatures, USSR Academy of Sciences, Preprint No.1-238 (in Russian), Moscow, 1988. [all data]
Dorofeeva O.V., 1986
Dorofeeva O.V.,
On calculation of thermodynamic properties of polycyclic aromatic hydrocarbons,
Thermochim. Acta, 1986, 102, 59-66. [all data]
Frenkel M., 1994
Frenkel M.,
Thermodynamics of Organic Compounds in the Gas State, Vol. I, II, Thermodynamics Research Center, College Station, Texas, 1994, 1994. [all data]
Chirico, Hossenloop, et al., 1987
Chirico, R.D.; Hossenloop, I.A.; Nguyen, A.; Strube, M.M.; Steele, W.V.,
Thermodynamic studies related to the hydrogenation of phenanthrene,
NIPER Report, 1987, 247, 107p. [all data]
Chirico, Gammon, et al., 1994
Chirico, R.D.; Gammon, B.E.; Hossenlopp, I.A.; Steele, W.V.,
Heat capacities of 1,2,3,4-tetrahydrophenanthrene at temp. between 5 K and 430 K and revised heat capacities of 9,10-dihydrophenanthrene beaween 10 K and 350 K,
J. Chem. Thermodyn., 1994, 26, 469-81. [all data]
Chirico, Hossenlopp, et al., 1987
Chirico, R.D.; Hossenlopp, I.A.; Nguyen, A.; Steele, W.V.,
Thermochem. and Thermophys. Prop. of Organic Compounds Derived from Fossil Substances. Thermodynamic Studies Related to the Hydrogenation of Anthracene, Natl. Inst. Pet. Energy Res. Rep. NIPER-239, Bartlesvill- e, OK, 1987. [all data]
Weast and Grasselli, 1989
CRC Handbook of Data on Organic Compounds, 2nd Editon, Weast,R.C and Grasselli, J.G., ed(s)., CRC Press, Inc., Boca Raton, FL, 1989, 1. [all data]
Chirico, Gammon, et al., 1994, 2
Chirico, R.D.; Gammon, B.E.; Steele, W.V.,
Heat capacities of 1,2,3,4-tetrahydrophenanthrene at temperatures between 5 K and 430 K and revised heat capacities of 9,10-dihydrophenanthrene at temperatures between 10 K and 350 K,
J. Chem. Thermodyn., 1994, 26, 5, 469, https://doi.org/10.1006/jcht.1994.1057
. [all data]
Frye, 1962
Frye, C.G.,
Equilibria in the hydrogenation of polycyclic aromatics,
J. Chem. Eng. Data, 1962, 7, 592-595. [all data]
Song, Lai, et al., 2003
Song, C.; Lai, W.-C.; Madhusudan Reddy, K.; Wei, B.,
Chapter 7. Temperature-programmed retention indices for GC and GC-MS of hydrocarbon fuels and simulated distillation GC of heavy oils
in Analytical advances for hydrocarbon research, Hsu,C.S., ed(s)., Kluwer Academic/Plenum Publishers, New York, 2003, 147-193. [all data]
Lai and Song, 1995
Lai, W.-C.; Song, C.,
Temperature-programmed retention indices for g.c. and g.c.-m.s. analysis of coal- and petroleum-derived liquid fuels,
Fuel, 1995, 74, 10, 1436-1451, https://doi.org/10.1016/0016-2361(95)00108-H
. [all data]
Ferrand, 1962
Ferrand, R.,
Gas phase chromatography using retention indices for the analysis of tars and their hydrogenation products,
Journees internationales d'etude des methodes de separation immediate at de chromatographie; Org. sur l'initiative du IX., 1962, 132-140. [all data]
Lee, Vassilaros, et al., 1979
Lee, M.L.; Vassilaros, D.L.; White, C.M.; Novotny, M.,
Retention Indices for Programmed-Temperature Capillary-Column Gas Chromatography of Polycyclic Aromatic Hydrocarbons,
Anal. Chem., 1979, 51, 6, 768-773, https://doi.org/10.1021/ac50042a043
. [all data]
Aracil, Font, et al., 2005
Aracil, I.; Font, R.; Conesa, J.A.,
Semivolatile and volatile compounds from the pyrolysis and combustion of polyvinyl chloride,
J. Anal. Appl. Pyrolysis, 2005, 74, 1-2, 465-478, https://doi.org/10.1016/j.jaap.2004.09.008
. [all data]
Shlyakhov, 1984
Shlyakhov, A.F.,
Gas chromatography in organic geochemistry, Nedra, Moscow, 1984, 221. [all data]