1-Hexene, 2-chloro-
- Formula: C6H11Cl
- Molecular weight: 118.605
- IUPAC Standard InChIKey: OQANCOWYULDETR-UHFFFAOYSA-N
- CAS Registry Number: 10124-73-9
- Chemical structure:
View 3d structure (requires JavaScript / HTML 5) - Other names: 2-chloro-1-hexene

Normal alkane RI, non-polar column, temperature ramp

Column type | Active phase | I | Reference | Comment |
---|---|---|---|---|
Capillary | OV-101 | 747. | Zenkevich, 2005 | 25. m/0.20 mm/0.10 μm, N2/He, 6. K/min; Tstart: 50. C; Tend: 250. C |

References

Zenkevich, 2005
Zenkevich, I.G.,
Experimentally measured retention indices., 2005. [all data]