Chlorpropham
- Formula: C10H12ClNO2
- Molecular weight: 213.661
- IUPAC Standard InChIKey: CWJSHJJYOPWUGX-UHFFFAOYSA-N
- CAS Registry Number: 101-21-3
- Chemical structure:
View 3d structure (requires JavaScript / HTML 5) - Other names: Carbamic acid, (3-chlorophenyl)-, 1-methylethyl ester; Carbanilic acid, m-chloro-, isopropyl ester; m-Chlorocarbanilic acid isopropyl ester; Chloro-IFK; Chloro-IPC; Chloropropham; ChlorIPC; CI-IPC; CIPC; Elbanil; Furloe 3 EC; Isopropyl m-chlorocarbanilate; Isopropyl N-(m-chlorophenyl)carbamate; Isopropyl N-chlorophenylcarbamate; Isopropyl 3-chlorocarbanilate; Liro CIPC; Metoxon; Nexoval; Prevenol 56; Preventol; Preventol 56; Triherbicide CIPC; Y 3; (3-Chlorophenyl)carbamic acid, 1-methylethyl ester; Chlorprophame; ENT 18,060; Fasco WY-HOE; Furloe; Isopropyl 3-chlorophenylcarbamate; Jack Wilson chloro 51(oil); N-(3-Chloor-fenyl)-isopropyl carbamaat; N-(3-Chlor-phenyl)-isopropyl-carbamat; N-(3-Chloro phenyl)carbamate d'isopropyle; N-(3-Chlorophenyl)carbamic acid, isopropyl ester; N-(3-Chlorophenyl)isopropyl carbamate; N-(3-Cloro-fenil)-isopropil-carbammato; Preweed; Sprout Nip; Spud-Nic; Spud-Nie; Stopgerme-S; Taterpex; 3-Chlorocarbanilic acid, isopropyl ester; Chlor IFC; Cl-IFK; Bygran; Mirvale; Isopropyl N-(3-chlorophenyl)carbamate; Beet-Kleen; Isopropyl chlorocarbanilate; Chlor IFK; Keim-Stop; Carbamic acid, N-(3-chlorophenyl)-, 1-methylethyl ester

Phase change data

Data compiled as indicated in comments:
BS - Robert L. Brown and Stephen E. Stein
TRC - Thermodynamics Research Center, NIST Boulder Laboratories, Chris Muzny director
Quantity | Value | Units | Method | Reference | Comment |
---|---|---|---|---|---|
Tfus | 315.00 | K | N/A | Donnelly, Drewes, et al., 1990 | Uncertainty assigned by TRC = 0.2 K; TRC |
Tfus | 315.7 | K | N/A | Plato and Glasgow, 1969 | Uncertainty assigned by TRC = 0.2 K; TRC |
Reduced pressure boiling point
Tboil (K) | Pressure (atm) | Reference | Comment |
---|---|---|---|
422.2 | 0.003 | Weast and Grasselli, 1989 | BS |

Kovats' RI, non-polar column, temperature ramp

Data compiled by: NIST Mass Spectrometry Data Center, William E. Wallace, director

Column type CapillaryCapillary
Active phase DB-1DB-5
Column length (m) 15.15.
Carrier gas HeHe
Substrate
Column diameter (mm) 0.250.25
Phase thickness (μm)
Tstart (C) 100.100.
Tend (C) 270.270.
Heat rate (K/min) 6.6.
Initial hold (min)
Final hold (min)
I 1629.1661.
ReferenceHall, Whitehead, et al., 1986Hall, Whitehead, et al., 1986
Comment MSDC-RI MSDC-RI

Kovats' RI, non-polar column, isothermal

View large format table.

Column type Active phase Temperature (C) I Reference Comment
PackedSE-30160.1626.Gerqasimenko and Voskoboinikov, 1987Column length: 1. m

Kovats' RI, non-polar column, custom temperature program

View large format table.

Column type Active phase I Reference Comment
CapillaryHP-51659.Tanabe, Mitobe, et al., 200030. m/0.32 mm/0.25 μm; Program: 50C(1min) => 20C/min => 150C => 10C/min => 280C(4min)
CapillaryDB-5MS1664.Tanabe, Mitobe, et al., 199630. m/0.32 mm/0.25 μm; Program: 50 C(1min)->20C/min->200C->10C/min->280C (1.5min)
PackedSE-301626.Osselton and Snelling, 1986N2, Chromosorb W HP; Column length: 2. m; Program: not specified

Van Den Dool and Kratz RI, non-polar column, temperature ramp

View large format table.

Column type Active phase I Reference Comment
CapillarySLB-5MS1657.Mondello, Casilli, et al., 200730. m/0.25 mm/0.25 μm, He, 2. K/min; Tstart: 70. C; Tend: 300. C
CapillarySLB-5MS1660.Mondello, Casilli, et al., 200730. m/0.25 mm/0.25 μm, He, 2. K/min; Tstart: 70. C; Tend: 300. C

Normal alkane RI, non-polar column, custom temperature program

View large format table.

Column type Active phase I Reference Comment
Capillary5 % Phenyl methyl siloxane1660.Department of Food Safety and Welfare, 200630. m/0.25 mm/0.25 μm, Helium; Program: 50 0C(1 min) 25 0C/min -> 125 0C 10 0C/min -> 300 0C (10 min)
CapillaryHP-51659.Kawara, Asada, et al., 200530. m/0.25 mm/0.25 μm; Program: 50 0C (1 min) 20 0C/min -> 150 0C 10 0C/min -> 280 0C
CapillaryUltra-11613.Tameo and Kiyos, 1991Program: not specified

Normal alkane RI, polar column, custom temperature program

View large format table.

Column type Active phase I Reference Comment
CapillaryCarbowax 20M2643.Tameo and Kiyos, 1991Program: not specified

References

Donnelly, Drewes, et al., 1990
Donnelly, J.R.; Drewes, L.A.; Johnson, R.L.; Munslow, W.D.; Knapp, K.K.; Sovocool, G.W.,
Purity and heat of fusion data for environmental standards as determined by differential scanning calorimetry,
Thermochim. Acta, 1990, 167, 2, 155, https://doi.org/10.1016/0040-6031(90)80476-F
. [all data]
Plato and Glasgow, 1969
Plato, C.; Glasgow, A.R., Jr.,
Differential scanning calorimetry as a general method for determining the purity and heat of fusion of high-purity organic chemicals. Application to 95 compounds,
Anal. Chem., 1969, 41, 2, 330, https://doi.org/10.1021/ac60271a041
. [all data]
Weast and Grasselli, 1989
CRC Handbook of Data on Organic Compounds, 2nd Editon, Weast,R.C and Grasselli, J.G., ed(s)., CRC Press, Inc., Boca Raton, FL, 1989, 1. [all data]