cadmium chloride
- Formula: CdCl2
- Molecular weight: 183.317
- CAS Registry Number: 10108-64-2

Phase change data

Data compiled by: William E. Acree, Jr., James S. Chickos
Enthalpy of vaporization
ΔvapH (kJ/mol) | Temperature (K) | Reference | Comment |
---|---|---|---|
132.6 | 950. | Bloom and Welch, 1958 | Based on data from 875. to 1026. K. |

References

Bloom and Welch, 1958
Bloom, H.; Welch, B.J.,
The Vapor Pressure of Cadmium and Zinc Chlorides,
J. Phys. Chem., 1958, 62, 12, 1594-1595, https://doi.org/10.1021/j150570a033
. [all data]