Cyclohexanamine, N-butyl-
- Formula: C10H21N
- Molecular weight: 155.2804
- IUPAC Standard InChIKey: VXXLEXCQCSPKFI-UHFFFAOYSA-N
- CAS Registry Number: 10108-56-2
- Chemical structure:
View 3d structure (requires JavaScript / HTML 5) - Other names: Cyclohexylamine, N-butyl-; Butylcyclohexylamine; N-Butylcyclohexylamine; cyclohexyl-n-butyl-amine

Phase change data

Data compiled as indicated in comments:
BS - Robert L. Brown and Stephen E. Stein
TRC - Thermodynamics Research Center, NIST Boulder Laboratories, Chris Muzny director
Quantity | Value | Units | Method | Reference | Comment |
---|---|---|---|---|---|
Tboil | 480.2 | K | N/A | Weast and Grasselli, 1989 | BS |
Quantity | Value | Units | Method | Reference | Comment |
Tfus | 228.2 | K | N/A | Anonymous, 1954 | Uncertainty assigned by TRC = 0.6 K; TRC |

Kovats' RI, non-polar column, isothermal

Column type | Active phase | Temperature (C) | I | Reference | Comment |
---|---|---|---|---|---|
Packed | Apiezon L | 100. | 1185. | Golovnya, Zhuravleva, et al., 1981 | N2, Chromosorb GAW; Column length: 2.7 m |

References

Weast and Grasselli, 1989
CRC Handbook of Data on Organic Compounds, 2nd Editon, Weast,R.C and Grasselli, J.G., ed(s)., CRC Press, Inc., Boca Raton, FL, 1989, 1. [all data]
Anonymous, 1954
Anonymous, R.,
, Am. Pet. Inst. Res. Proj. 45, Tech. Rep. 13, Ohio State Univ., 1954. [all data]
Golovnya, Zhuravleva, et al., 1981
Golovnya, R.V.; Zhuravleva, I.L.; Svetlova, N.I.; Grigor'eva, D.N.; Terenina, M.B.; Gutnik, S.B.,
Gas-chromatographic behavior of secondary isoaliphatic and alicyclic amines,
J. Anal. Chem. USSR (Engl. Transl.), 1981, 36, 4, 501-505. [all data]