Nitrogen dioxide
- Formula: NO2
- Molecular weight: 46.0055
- IUPAC Standard InChIKey: JCXJVPUVTGWSNB-UHFFFAOYSA-N
- CAS Registry Number: 10102-44-0
- Chemical structure:
View 3d structure (requires JavaScript / HTML 5) - Other names: Nitrogen oxide; Nitrito; Nitro; Nitrogen peroxide; Azote; Rcra waste number P078; Stickstoffdioxid; Stikstofdioxyde; Nitrogen dioxide (NO2)

Gas phase thermochemistry data

Quantity | Value | Units | Method | Reference | Comment |
---|---|---|---|---|---|
ΔfH°gas | 33.10 | kJ/mol | Review | Chase, 1998 | Data last reviewed in September, 1964 |
Quantity | Value | Units | Method | Reference | Comment |
S°gas,1 bar | 240.04 | J/mol*K | Review | Chase, 1998 | Data last reviewed in September, 1964 |
Gas Phase Heat Capacity (Shomate Equation)
Cp° = A + B*t + C*t2 + D*t3 +
E/t2
H° − H°298.15= A*t + B*t2/2 +
C*t3/3 + D*t4/4 − E/t + F − H
S° = A*ln(t) + B*t + C*t2/2 + D*t3/3 −
E/(2*t2) + G
Cp = heat capacity (J/mol*K)
H° = standard enthalpy (kJ/mol)
S° = standard entropy (J/mol*K)
t = temperature (K) / 1000.
View plot Requires a JavaScript / HTML 5 canvas capable browser.
Temperature (K) | 298. to 1200. | 1200. to 6000. |
---|---|---|
A | 16.10857 | 56.82541 |
B | 75.89525 | 0.738053 |
C | -54.38740 | -0.144721 |
D | 14.30777 | 0.009777 |
E | 0.239423 | -5.459911 |
F | 26.17464 | 2.846456 |
G | 240.5386 | 290.5056 |
H | 33.09502 | 33.09502 |
Reference | Chase, 1998 | Chase, 1998 |
Comment | Data last reviewed in September, 1964 | Data last reviewed in September, 1964 |

Reaction thermochemistry data

Data compiled as indicated in comments:
B - John E. Bartmess
ALS - Hussein Y. Afeefy, Joel F. Liebman, and Stephen E. Stein
Individual Reactions
By formula: (NO2- • 4294967295NO2) + NO2 = NO2-
Quantity | Value | Units | Method | Reference | Comment |
---|---|---|---|---|---|
ΔrH° | 449.0 ± 1.3 | kJ/mol | N/A | Davidson, Fehsenfeld, et al., 1977 | gas phase; Relative to HBr, reevaluated with current HBr acidity. Excited state at 3.0 eV,81WU /TIE.; B |
ΔrH° | <192.9 | kJ/mol | PDis | Smith, Lee, et al., 1979 | gas phase; Isomer: O4- + NO ->.; B |
ΔrH° | 276. ± 21. | kJ/mol | PDis | Smith, Lee, et al., 1978 | gas phase; B |
By formula: 0.76NO2 + 0.62N2O4 + CH3NO3 = N2O5 + CH3NO2
Quantity | Value | Units | Method | Reference | Comment |
---|---|---|---|---|---|
ΔrH° | 36.24 | kJ/mol | Cm | Ray and Ogg, 1959 | liquid phase; ALS |
By formula: CH3NO2 + HNO3 = 2NO2 + CH4O
Quantity | Value | Units | Method | Reference | Comment |
---|---|---|---|---|---|
ΔrH° | 66.48 | kJ/mol | Eqk | Silverwood and Thomas, 1967 | gas phase; ALS |

Henry's Law data

Data compiled by: Rolf Sander
Henry's Law constant (water solution)
kH(T) = k°H exp(d(ln(kH))/d(1/T) ((1/T) - 1/(298.15 K)))
k°H = Henry's law constant for solubility in water at 298.15 K (mol/(kg*bar))
d(ln(kH))/d(1/T) = Temperature dependence constant (K)
k°H (mol/(kg*bar)) | d(ln(kH))/d(1/T) (K) | Method | Reference | Comment |
---|---|---|---|---|
0.012 | 2500. | T | N/A | |
0.010 | N/A | N/A | ||
0.041 | C | N/A | ||
0.0070 | M | N/A | Value at T = 295. K. | |
0.040 | C | N/A | ||
0.024 | C | N/A | ||
0.012 | L | N/A | ||
0.034 | 1800. | T | N/A | Calculated from correlation between the polarizabilities and solubilities of stable gases. The temperature dependence is an estimate of the upper limit. |

Phase change data

Data compiled as indicated in comments:
TRC - Thermodynamics Research Center, NIST Boulder Laboratories, Chris Muzny director
Quantity | Value | Units | Method | Reference | Comment |
---|---|---|---|---|---|
Tboil | 295.08 | K | N/A | Thorpe, 1880 | Uncertainty assigned by TRC = 0.5 K; TRC |
Antoine Equation Parameters
log10(P) = A − (B / (T + C))
P = vapor pressure (atm)
T = temperature (K)
View plot Requires a JavaScript / HTML 5 canvas capable browser.
Temperature (K) | A | B | C | Reference | Comment |
---|---|---|---|---|---|
217.6 to 294. | 3.34677 | 540.635 | -131.93 | Stull, 1947 | Coefficents calculated by NIST from author's data. |

Gas phase ion energetics data

Data evaluated as indicated in comments:
HL - Edward P. Hunter and Sharon G. Lias
L - Sharon G. Lias
Data compiled as indicated in comments:
B - John E. Bartmess
LL - Sharon G. Lias and Joel F. Liebman
LBLHLM - Sharon G. Lias, John E. Bartmess, Joel F. Liebman, John L. Holmes, Rhoda D. Levin, and W. Gary Mallard
LLK - Sharon G. Lias, Rhoda D. Levin, and Sherif A. Kafafi
RDSH - Henry M. Rosenstock, Keith Draxl, Bruce W. Steiner, and John T. Herron
Quantity | Value | Units | Method | Reference | Comment |
---|---|---|---|---|---|
IE (evaluated) | 9.586 ± 0.002 | eV | N/A | N/A | L |
Quantity | Value | Units | Method | Reference | Comment |
Proton affinity (review) | 141.3 | kcal/mol | N/A | Hunter and Lias, 1998 | HL |
Quantity | Value | Units | Method | Reference | Comment |
Gas basicity | 133.9 | kcal/mol | N/A | Hunter and Lias, 1998 | HL |
Electron affinity determinations
Ionization energy determinations
IE (eV) | Method | Reference | Comment |
---|---|---|---|
9.60 ± 0.03 | END | Clemmer and Armentrout, 1992 | LL |
9.586 ± 0.002 | LS | Haber, Zwanziger, et al., 1988 | LL |
11.23 | PE | Kimura, Katsumata, et al., 1981 | LLK |
10.4 ± 0.3 | EI | Stephan, Helm, et al., 1980 | LLK |
≤9.62 ± 0.01 | PI | Killgoar, Leroi, et al., 1973 | LLK |
9.75 ± 0.01 | PI | Dibeler and Walker, 1967 | RDSH |
11.23 | PE | Katsumata, Shiromaru, et al., 1982 | Vertical value; LBLHLM |
Appearance energy determinations
Ion | AE (eV) | Other Products | Method | Reference | Comment |
---|---|---|---|---|---|
NO+ | 12.34 | O | PI | Dibeler and Walker, 1967 | RDSH |
O+ | 16.82 | NO | PI | Dibeler, Walker, et al., 1967 | RDSH |
Anion protonation reactions
Quantity | Value | Units | Method | Reference | Comment |
---|---|---|---|---|---|
ΔrH° | 340.23 ± 0.21 | kcal/mol | D-EA | Ervin, Ho, et al., 1988 | gas phase; B |
Quantity | Value | Units | Method | Reference | Comment |
ΔrG° | 333.73 ± 0.31 | kcal/mol | H-TS | Ervin, Ho, et al., 1988 | gas phase; B |

Ion clustering data

Data compiled by: John E. Bartmess
Clustering reactions
By formula: (NO2- • 4294967295NO2) + NO2 = NO2-
Quantity | Value | Units | Method | Reference | Comment |
---|---|---|---|---|---|
ΔrH° | 107.31 ± 0.30 | kcal/mol | N/A | Davidson, Fehsenfeld, et al., 1977 | gas phase; Relative to HBr, reevaluated with current HBr acidity. Excited state at 3.0 eV,81WU /TIE. |
ΔrH° | <46.10 | kcal/mol | PDis | Smith, Lee, et al., 1979 | gas phase; Isomer: O4- + NO ->. |
ΔrH° | 66.0 ± 5.0 | kcal/mol | PDis | Smith, Lee, et al., 1978 | gas phase |

References

Chase, 1998
Chase, M.W., Jr.,
NIST-JANAF Themochemical Tables, Fourth Edition,
J. Phys. Chem. Ref. Data, Monograph 9, 1998, 1-1951. [all data]
Davidson, Fehsenfeld, et al., 1977
Davidson, J.A.; Fehsenfeld, F.C.; Howard, C.J.,
The heats of formation of NO3- and NO3- association complexes with HNO3 and HBr,
Int. J. Chem. Kinet., 1977, 9, 17. [all data]
Smith, Lee, et al., 1979
Smith, G.P.; Lee, L.C.; Moseley, J.T.,
Photodissociation and photodetachment of molecular negative ions. VIII. Nitrogen oxides and hydrates,3500-8250 Å,
J. Chem. Phys., 1979, 71, 4034. [all data]
Smith, Lee, et al., 1978
Smith, G.P.; Lee, L.C.; Cosby, P.C.; Peterson, J.R.; Moseley, J.T.,
Photodissociation and photodetachment of molecular negative ions. V. Atmospheric ions from 7000 to 8400 A),
J. Chem. Phys., 1978, 68, 3818. [all data]
Ray and Ogg, 1959
Ray, J.D.; Ogg, R.A., Jr.,
The heat of formation of methyl nitrate,
J. Phys. Chem., 1959, 63, 1522-1523. [all data]
Silverwood and Thomas, 1967
Silverwood, R.; Thomas, J.H.,
Reaction between methanol and nitrogen dioxide. Part 1.-Low-temperature reaction and the thermodynamic constants of methyl nitrite,
J. Chem. Soc. Faraday Trans., 1967, 63, 2476-2479. [all data]