Nitric oxide
- Formula: NO
- Molecular weight: 30.0061
- IUPAC Standard InChIKey: MWUXSHHQAYIFBG-UHFFFAOYSA-N
- CAS Registry Number: 10102-43-9
- Chemical structure:
View 3d structure (requires JavaScript / HTML 5) - Other names: Nitrogen oxide; Nitrogen monoxide; Nitrosyl radical; NO; Amidogen, oxo-; Nitrogen oxide (NO); UN 1660

Gas phase thermochemistry data

Quantity | Value | Units | Method | Reference | Comment |
---|---|---|---|---|---|
ΔfH°gas | 90.29 | kJ/mol | Review | Chase, 1998 | Data last reviewed in June, 1963 |
Quantity | Value | Units | Method | Reference | Comment |
S°gas,1 bar | 210.76 | J/mol*K | Review | Chase, 1998 | Data last reviewed in June, 1963 |
Gas Phase Heat Capacity (Shomate Equation)
Cp° = A + B*t + C*t2 + D*t3 +
E/t2
H° − H°298.15= A*t + B*t2/2 +
C*t3/3 + D*t4/4 − E/t + F − H
S° = A*ln(t) + B*t + C*t2/2 + D*t3/3 −
E/(2*t2) + G
Cp = heat capacity (J/mol*K)
H° = standard enthalpy (kJ/mol)
S° = standard entropy (J/mol*K)
t = temperature (K) / 1000.
View plot Requires a JavaScript / HTML 5 canvas capable browser.
Temperature (K) | 298. to 1200. | 1200. to 6000. |
---|---|---|
A | 23.83491 | 35.99169 |
B | 12.58878 | 0.957170 |
C | -1.139011 | -0.148032 |
D | -1.497459 | 0.009974 |
E | 0.214194 | -3.004088 |
F | 83.35783 | 73.10787 |
G | 237.1219 | 246.1619 |
H | 90.29114 | 90.29114 |
Reference | Chase, 1998 | Chase, 1998 |
Comment | Data last reviewed in June, 1963 | Data last reviewed in June, 1963 |

Reaction thermochemistry data

Data compiled as indicated in comments:
M - Michael M. Meot-Ner (Mautner) and Sharon G. Lias
ALS - Hussein Y. Afeefy, Joel F. Liebman, and Stephen E. Stein
Individual Reactions
By formula: NO- + NO = (NO- • NO)
Quantity | Value | Units | Method | Reference | Comment |
---|---|---|---|---|---|
ΔrH° | 57.7 | kJ/mol | PI | Linn, Ono, et al., 1981 | gas phase; M |
ΔrH° | 56.9 | kJ/mol | PI | Ng, Tiedemann, et al., 1977 | gas phase; M |
Free energy of reaction
ΔrG° (kJ/mol) | T (K) | Method | Reference | Comment |
---|---|---|---|---|
29. | 296. | SAMS | Puckett and Teague, 1971 | gas phase; M |
By formula: (NO- • NO) + NO = (NO- • 2NO)
Quantity | Value | Units | Method | Reference | Comment |
---|---|---|---|---|---|
ΔrH° | 31. | kJ/mol | PI | Linn, Ono, et al., 1981 | gas phase; M |
Free energy of reaction
ΔrG° (kJ/mol) | T (K) | Method | Reference | Comment |
---|---|---|---|---|
7.9 | 296. | SAMS | Puckett and Teague, 1971 | gas phase; M |
By formula: (Ni+ • NO) + NO = (Ni+ • 2NO)
Enthalpy of reaction
ΔrH° (kJ/mol) | T (K) | Method | Reference | Comment |
---|---|---|---|---|
115. (+5.0,-0.) | CID | Khan, Steele, et al., 1995 | gas phase; guided ion beam CID; M |
By formula: Ni+ + NO = (Ni+ • NO)
Enthalpy of reaction
ΔrH° (kJ/mol) | T (K) | Method | Reference | Comment |
---|---|---|---|---|
123. (+6.7,-0.) | CID | Khan, Steele, et al., 1995 | gas phase; guided ion beam CID; M |
By formula: (NO- • 2NO) + NO = (NO- • 3NO)
Quantity | Value | Units | Method | Reference | Comment |
---|---|---|---|---|---|
ΔrH° | 15. | kJ/mol | PI | Linn, Ono, et al., 1981 | gas phase; M |
By formula: (NO- • 3NO) + NO = (NO- • 4NO)
Quantity | Value | Units | Method | Reference | Comment |
---|---|---|---|---|---|
ΔrH° | 15. | kJ/mol | PI | Linn, Ono, et al., 1981 | gas phase; M |
By formula: (NO- • 4NO) + NO = (NO- • 5NO)
Quantity | Value | Units | Method | Reference | Comment |
---|---|---|---|---|---|
ΔrH° | 9.6 | kJ/mol | PI | Linn, Ono, et al., 1981 | gas phase; M |
By formula: C2H5NO2 = NO + C2H5O
Quantity | Value | Units | Method | Reference | Comment |
---|---|---|---|---|---|
ΔrH° | 158. | kJ/mol | Kin | Rebbert and Laidler, 1952 | gas phase; ALS |

Henry's Law data

Data compiled by: Rolf Sander
Henry's Law constant (water solution)
kH(T) = k°H exp(d(ln(kH))/d(1/T) ((1/T) - 1/(298.15 K)))
k°H = Henry's law constant for solubility in water at 298.15 K (mol/(kg*bar))
d(ln(kH))/d(1/T) = Temperature dependence constant (K)
k°H (mol/(kg*bar)) | d(ln(kH))/d(1/T) (K) | Method | Reference | Comment |
---|---|---|---|---|
0.0019 | 1400. | L | N/A | |
0.0019 | 1700. | Q | N/A | Only the tabulated data between T = 273. K and T = 303. K from missing citation was used to derive kH and -Δ kH/R. Above T = 303. K the tabulated data could not be parameterized by equation (reference missing) very well. The partial pressure of water vapor (needed to convert some Henry's law constants) was calculated using the formula given by missing citation. The quantities A and α from missing citation were assumed to be identical. |
0.0019 | C | N/A | ||
0.0019 | 1500. | L | N/A | |
0.0014 | M | N/A | ||
7.9×10-7 | 3800. | L | N/A |

Phase change data

Data compiled by: William E. Acree, Jr., James S. Chickos
Enthalpy of vaporization
ΔvapH (kcal/mol) | Temperature (K) | Method | Reference |
---|---|---|---|
3.30 | 212. | C | Johnston and Giauque, 1929 |

Gas phase ion energetics data

Data evaluated as indicated in comments:
HL - Edward P. Hunter and Sharon G. Lias
L - Sharon G. Lias
Data compiled as indicated in comments:
B - John E. Bartmess
MM - Michael M. Meot-Ner (Mautner)
LL - Sharon G. Lias and Joel F. Liebman
LBLHLM - Sharon G. Lias, John E. Bartmess, Joel F. Liebman, John L. Holmes, Rhoda D. Levin, and W. Gary Mallard
LLK - Sharon G. Lias, Rhoda D. Levin, and Sherif A. Kafafi
RDSH - Henry M. Rosenstock, Keith Draxl, Bruce W. Steiner, and John T. Herron
Quantity | Value | Units | Method | Reference | Comment |
---|---|---|---|---|---|
IE (evaluated) | 9.2642 ± 0.00002 | eV | N/A | N/A | L |
Quantity | Value | Units | Method | Reference | Comment |
Proton affinity (review) | 127.1 | kcal/mol | N/A | Hunter and Lias, 1998 | HL |
Quantity | Value | Units | Method | Reference | Comment |
Gas basicity | 120.8 | kcal/mol | N/A | Hunter and Lias, 1998 | HL |
Proton affinity at 298K
Proton affinity (kcal/mol) | Reference | Comment |
---|---|---|
125.75 ± 0.30 | Kuo, Zhang, et al., 1997 | T = 0K; Photoionization of HNO yields DHf(HNO+) from which PA(NO) is calculated at 0 K and 298K.; MM |
Ionization energy determinations
Appearance energy determinations
Ion | AE (eV) | Other Products | Method | Reference | Comment |
---|---|---|---|---|---|
N+ | 19.56 | O- | PI | Erman, Karawajczyk, et al., 1995 | LL |
N+ | 21.02 | O | PI | Erman, Karawajczyk, et al., 1995 | LL |
N+ | 19.56 ± 0.03 | O- | PI | Oertel, Schenk, et al., 1980 | LLK |
N+ | 19.6 ± 0.2 | O- | EI | Locht and Momigny, 1971 | LLK |
N+ | 19.94 ± 0.14 | O- | EI | Hierl and Franklin, 1967 | RDSH |
N+ | 34.1 ± 0.7 | O+ | EI | Appell, Durup, et al., 1966 | RDSH |
N+ | 19.55 ± 0.04 | O- | EI | Cloutier and Schiff, 1959 | RDSH |
N+ | 21.11 ± 0.04 | O | EI | Cloutier and Schiff, 1959 | RDSH |
N4+ | 21.78 ± 0.11 | O | EI | Hierl and Franklin, 1967 | RDSH |
O+ | 20.12 | N | PI | Erman, Karawajczyk, et al., 1995 | LL |
O+ | 20.1 ± 0.3 | N | EI | Doong and Bizot, 1973 | LLK |
O+ | 20.46 ± 0.10 | N | EI | Hierl and Franklin, 1967 | RDSH |
O+ | 20.11 ± 0.03 | N | EI | Cloutier and Schiff, 1959 | RDSH |
Anion protonation reactions
Quantity | Value | Units | Method | Reference | Comment |
---|---|---|---|---|---|
ΔrH° | 361.27 ± 0.15 | kcal/mol | D-EA | Travers, Cowles, et al., 1989 | gas phase; ground state triplet anion; B |
Quantity | Value | Units | Method | Reference | Comment |
ΔrG° | 354.68 ± 0.34 | kcal/mol | H-TS | Travers, Cowles, et al., 1989 | gas phase; ground state triplet anion; B |

Ion clustering data

Data compiled by: Michael M. Meot-Ner (Mautner) and Sharon G. Lias
Clustering reactions
By formula: NO- + NO = (NO- • NO)
Quantity | Value | Units | Method | Reference | Comment |
---|---|---|---|---|---|
ΔrH° | 13.8 | kcal/mol | PI | Linn, Ono, et al., 1981 | gas phase |
ΔrH° | 13.6 | kcal/mol | PI | Ng, Tiedemann, et al., 1977 | gas phase |
Free energy of reaction
ΔrG° (kcal/mol) | T (K) | Method | Reference | Comment |
---|---|---|---|---|
7.0 | 296. | SAMS | Puckett and Teague, 1971 | gas phase |
By formula: (NO- • NO) + NO = (NO- • 2NO)
Quantity | Value | Units | Method | Reference | Comment |
---|---|---|---|---|---|
ΔrH° | 7.4 | kcal/mol | PI | Linn, Ono, et al., 1981 | gas phase |
Free energy of reaction
ΔrG° (kcal/mol) | T (K) | Method | Reference | Comment |
---|---|---|---|---|
1.9 | 296. | SAMS | Puckett and Teague, 1971 | gas phase |
By formula: (NO- • 2NO) + NO = (NO- • 3NO)
Quantity | Value | Units | Method | Reference | Comment |
---|---|---|---|---|---|
ΔrH° | 3.7 | kcal/mol | PI | Linn, Ono, et al., 1981 | gas phase |
By formula: (NO- • 3NO) + NO = (NO- • 4NO)
Quantity | Value | Units | Method | Reference | Comment |
---|---|---|---|---|---|
ΔrH° | 3.5 | kcal/mol | PI | Linn, Ono, et al., 1981 | gas phase |
By formula: (NO- • 4NO) + NO = (NO- • 5NO)
Quantity | Value | Units | Method | Reference | Comment |
---|---|---|---|---|---|
ΔrH° | 2.3 | kcal/mol | PI | Linn, Ono, et al., 1981 | gas phase |
By formula: Ni+ + NO = (Ni+ • NO)
Enthalpy of reaction
ΔrH° (kcal/mol) | T (K) | Method | Reference | Comment |
---|---|---|---|---|
29.3 (+1.6,-0.) | CID | Khan, Steele, et al., 1995 | gas phase; guided ion beam CID |
By formula: (Ni+ • NO) + NO = (Ni+ • 2NO)
Enthalpy of reaction
ΔrH° (kcal/mol) | T (K) | Method | Reference | Comment |
---|---|---|---|---|
27.4 (+1.2,-0.) | CID | Khan, Steele, et al., 1995 | gas phase; guided ion beam CID |

References

Chase, 1998
Chase, M.W., Jr.,
NIST-JANAF Themochemical Tables, Fourth Edition,
J. Phys. Chem. Ref. Data, Monograph 9, 1998, 1-1951. [all data]
Linn, Ono, et al., 1981
Linn, S.H.; Ono, Y.; Ng, C.Y.,
Molecular Beam Photoionization Study of CO, N2, and NO Dimers and Clusters,
J. Chem. Phys., 1981, 74, 6, 3342, https://doi.org/10.1063/1.441486
. [all data]
Ng, Tiedemann, et al., 1977
Ng, C.Y.; Tiedemann, P.W.; Mahan, B.H.; Lee, Y.T.,
The Binding Energy between NO and NO+,
J. Chem. Phys., 1977, 66, 9, 3985, https://doi.org/10.1063/1.434450
. [all data]
Puckett and Teague, 1971
Puckett, L.J.; Teague, A.W.,
Production of H3O+.nH2O from NO+ Precursor in NO - H2O Gas Mixtures,
J. Chem. Phys., 1971, 54, 6, 2564, https://doi.org/10.1063/1.1675213
. [all data]
Khan, Steele, et al., 1995
Khan, F.A.; Steele, D.L.; Armentrout, P.B.,
Ligand effects in organometallic thermochemistry: The sequential bond energies of Ni(CO)x+ and Ni(N2)x+ (x = 1-4) and Ni(NO)x+ (x = 1-3) [Data derived from reported bond energies taking value of 8.273±0.046 eV for IE[Ni(CO)4]],
J. Phys. Chem., 1995, 99, 7819. [all data]
Rebbert and Laidler, 1952
Rebbert, R.E.; Laidler, K.J.,
Kinetics of the decomposition of diethyl peroxide,
J. Chem. Phys., 1952, 20, 574-577. [all data]