CAS Reg. No. 101021-48-1
- CAS Registry Number: 101021-48-1

Reaction thermochemistry data

Data compiled by: John E. Bartmess
Individual Reactions
(CAS Reg. No. 101021-48-1 • 4294967295) +
= CAS Reg. No. 101021-48-1
By formula: (CAS Reg. No. 101021-48-1 • 4294967295Se) + Se = CAS Reg. No. 101021-48-1
Quantity | Value | Units | Method | Reference | Comment |
---|---|---|---|---|---|
ΔrH° | 468. ± 21. | kJ/mol | N/A | Coe, Snodgrass, et al., 1986 | gas phase |

References

Coe, Snodgrass, et al., 1986
Coe, J.V.; Snodgrass, J.T.; Freidhoff, C.B.; McHugh, K.M.; Bowen, K.H.,
Photoelectron spectroscopy of the negative ion SeO-,
J. Chem. Phys., 1986, 84, 618. [all data]