Amyl-t-butyl ether
- Formula: C9H20O
- Molecular weight: 144.2545
- IUPAC Standard InChIKey: BWRSHLROMAZEBM-UHFFFAOYSA-N
- CAS Registry Number: 10100-95-5
- Chemical structure:
View 3d structure (requires JavaScript / HTML 5) - Species with the same structure:

Gas phase thermochemistry data

Data compiled by: Hussein Y. Afeefy, Joel F. Liebman, and Stephen E. Stein
Quantity | Value | Units | Method | Reference | Comment |
---|---|---|---|---|---|
ΔfH°gas | -380.6 ± 6.8 | kJ/mol | Eqk | Rozhnov, Barkov, et al., 1990 |

Phase change data

Data compiled as indicated in comments:
AC - William E. Acree, Jr., James S. Chickos
ALS - Hussein Y. Afeefy, Joel F. Liebman, and Stephen E. Stein
Quantity | Value | Units | Method | Reference | Comment |
---|---|---|---|---|---|
ΔvapH° | 48.3 | kJ/mol | N/A | Verevkin, 2002 | See also Verevkin, Krasnykh, et al., 2003.; AC |
ΔvapH° | 46.3 | kJ/mol | N/A | Verevkin, 2002 | See also Verevkin, Krasnykh, et al., 2003.; AC |
ΔvapH° | 46.89 ± 0.99 | kJ/mol | V | Rozhnov, Barkov, et al., 1990 | ALS |
ΔvapH° | 46.9 ± 1.0 | kJ/mol | EB | Rozhnov, Barkov, et al., 1990 | Based on data from 319. to 365. K.; AC |
Enthalpy of vaporization
ΔvapH (kJ/mol) | Temperature (K) | Method | Reference | Comment |
---|---|---|---|---|
43.7 | 334. | EB | Rozhnov, Barkov, et al., 1990 | Based on data from 319. to 365. K.; AC |

References

Rozhnov, Barkov, et al., 1990
Rozhnov, A.M.; Barkov, V.I.; Sharonov, K.G.; Tsvetkov, V.S.,
Investigation of the equilibria of the reaction: CH3(CH2)4OH + (CH3)2C:CH2 = CH3(CH2)4OC(CH3)3,
J. Chem. Thermodyn., 1990, 22, 327-333. [all data]
Verevkin, 2002
Verevkin, Sergey P.,
Improved Benson Increments for the Estimation of Standard Enthalpies of Formation and Enthalpies of Vaporization of Alkyl Ethers, Acetals, Ketals, and Ortho Esters,
J. Chem. Eng. Data, 2002, 47, 5, 1071-1097, https://doi.org/10.1021/je020023o
. [all data]
Verevkin, Krasnykh, et al., 2003
Verevkin, Sergey P.; Krasnykh, Eugen L.; Vasiltsova, Tatiana V.; Heintz, Andreas,
Determination of Ambient Temperature Vapor Pressures and Vaporization Enthalpies of Branched Ethers,
J. Chem. Eng. Data, 2003, 48, 3, 591-599, https://doi.org/10.1021/je0255980
. [all data]