2-Butenedioic acid (Z)-, bis(1-methylethyl) ester
- Formula: C10H16O4
- Molecular weight: 200.2316
- IUPAC Standard InChIKey: FNMTVMWFISHPEV-WAYWQWQTSA-N
- CAS Registry Number: 10099-70-4
- Chemical structure:
View 3d structure (requires JavaScript / HTML 5) - Other names: Maleic acid, diisopropyl ester; 2-Butenedioic acid, bis(1-methylethyl) ester; Diisopropylester kyseliny maleinove; diisopropyl maleate

Phase change data

Data compiled by: Thermodynamics Research Center, NIST Boulder Laboratories, Chris Muzny director
Quantity | Value | Units | Method | Reference | Comment |
---|---|---|---|---|---|
Tfus | 243.0 | K | N/A | Anonymous, 1953 | Uncertainty assigned by TRC = 0.6 K |

References

Anonymous, 1953
Anonymous, R.,
, Physical Properties of Chemical Substances, Dow Chemical Company, 1953. [all data]