1-Fluoro-2-methylbutane
- Formula: C5H11F
- Molecular weight: 90.1392
- IUPAC Standard InChIKey: HQNOCESAXBXZAY-UHFFFAOYSA-N
- CAS Registry Number: 10086-64-3
- Chemical structure:
View 3d structure (requires JavaScript / HTML 5) - Permanent link for this species. Use this link for bookmarking this species for future reference.

Phase change data

Data compiled by: William E. Acree, Jr., James S. Chickos
Enthalpy of vaporization
ΔvapH (kJ/mol) | Temperature (K) | Method | Reference | Comment |
---|---|---|---|---|
30.7 | 302. | A | Stephenson and Malanowski, 1987 | Based on data from 287. to 329. K. See also Dykyj, 1972. |

References

Stephenson and Malanowski, 1987
Stephenson, Richard M.; Malanowski, Stanislaw,
Handbook of the Thermodynamics of Organic Compounds, 1987, https://doi.org/10.1007/978-94-009-3173-2
. [all data]
Dykyj, 1972
Dykyj, J.,
Petrochemia, 1972, 12, 1, 13. [all data]