Piperidine, 1-nitroso-
- Formula: C5H10N2O
- Molecular weight: 114.1457
- IUPAC Standard InChIKey: UWSDONTXWQOZFN-UHFFFAOYSA-N
- CAS Registry Number: 100-75-4
- Chemical structure:
View 3d structure (requires JavaScript / HTML 5) - Other names: N-Nitrosopiperidine; 1-Nitrosopiperidine; N-Nitroso-piperidin; Nitrosopiperidin; No-Pip; NPIP; N-N-Pip; Pyridine, hexahydro-N-nitroso-; Rcra waste number U179

Gas phase thermochemistry data

Data compiled by: Hussein Y. Afeefy, Joel F. Liebman, and Stephen E. Stein
Quantity | Value | Units | Method | Reference | Comment |
---|---|---|---|---|---|
ΔfH°gas | 17. ± 2. | kJ/mol | Ccb | Golovanova, Pepekin, et al., 1974 |

Condensed phase thermochemistry data

Data compiled by: Hussein Y. Afeefy, Joel F. Liebman, and Stephen E. Stein
Quantity | Value | Units | Method | Reference | Comment |
---|---|---|---|---|---|
ΔfH°liquid | -31. ± 1. | kJ/mol | Ccb | Golovanova, Pepekin, et al., 1974 | |
Quantity | Value | Units | Method | Reference | Comment |
ΔcH°liquid | -3366. ± 1. | kJ/mol | Ccb | Golovanova, Pepekin, et al., 1974 |

Phase change data

Data compiled as indicated in comments:
BS - Robert L. Brown and Stephen E. Stein
AC - William E. Acree, Jr., James S. Chickos
ALS - Hussein Y. Afeefy, Joel F. Liebman, and Stephen E. Stein
Reduced pressure boiling point
Tboil (K) | Pressure (bar) | Reference | Comment |
---|---|---|---|
382.2 | 0.027 | Weast and Grasselli, 1989 | BS |
Enthalpy of vaporization
ΔvapH (kJ/mol) | Temperature (K) | Method | Reference | Comment |
---|---|---|---|---|
47.7 | 348. | A | Stephenson and Malanowski, 1987 | Based on data from 333. to 383. K.; AC |
47.7 ± 0.8 | 333. | V | Golovanova, Pepekin, et al., 1974 | ALS |

Normal alkane RI, non-polar column, temperature ramp

Column type | Active phase | I | Reference | Comment |
---|---|---|---|---|
Capillary | OV-101 | 1040. | Zenkevich, 2005 | 25. m/0.20 mm/0.10 μm, N2/He, 6. K/min; Tstart: 50. C; Tend: 250. C |

Lee's RI, non-polar column, temperature ramp

Column type | Active phase | I | Reference | Comment |
---|---|---|---|---|
Capillary | DB-5MS | 184.19 | Chen, Keeran, et al., 2002 | 30. m/0.25 mm/0.5 μm, 40. C @ 1. min, 10. K/min; Tend: 310. C |
Capillary | DB-5MS | 185.84 | Chen, Keeran, et al., 2002 | 30. m/0.25 mm/0.5 μm, 40. C @ 1. min, 4. K/min; Tend: 310. C |

References

Golovanova, Pepekin, et al., 1974
Golovanova, O.F.; Pepekin, V.I.; Korsunskii, B.L.; Gafurov, R.G.; Eremenko, L.T.; Dubovitskii, F.I.,
Kinetic and thermochemical investigation of N-nitrosopiperidine,
Bull. Acad. Sci. USSR, Div. Chem. Sci., 1974, 1417-1419. [all data]
Weast and Grasselli, 1989
CRC Handbook of Data on Organic Compounds, 2nd Editon, Weast,R.C and Grasselli, J.G., ed(s)., CRC Press, Inc., Boca Raton, FL, 1989, 1. [all data]
Stephenson and Malanowski, 1987
Stephenson, Richard M.; Malanowski, Stanislaw,
Handbook of the Thermodynamics of Organic Compounds, 1987, https://doi.org/10.1007/978-94-009-3173-2
. [all data]
Zenkevich, 2005
Zenkevich, I.G.,
Experimentally measured retention indices., 2005. [all data]
Chen, Keeran, et al., 2002
Chen, P.H.; Keeran, W.S.; Van Ausdale, W.A.; Schindler, D.R.; Roberts, D.W.,
Application of Lee retention indices to the confirmation of tentatively identified compounds from GC/MS analysis of environmental samples, Technical paper, Analytical Services Division, Environmental ScienceEngineering, Inc, PO Box 1703, Gainesville, FL 32602, 2002, 11. [all data]